{"text_format":"1","workbook":"xlsx","n_sheets":115,"sheets":["PRESENTACION","ESTADÍSTICAS BÁSICAS","PRIMERA INFANCIA E INICIAL "," II-1.1.1","II-1.1.2","II-1.2.1","II-1.2.2","II-1.2.3","II-1.2.4","II-1.2.5","II-1.2.6","II-1.2.7","II-1.3.1","II-1.3.2","II-1.3.3 "," PRIMARIA ","II-2.1.1"," II-2.1.2","II-2.1.3","II-2.1.4","II-2.2.1","II-2.2.2","II-2.2.3","II-2.2.4","II-2.2.5","II-2.2.6","II-2.2.7","II-2.2.8","II-2.2.9","II-2.2.10","II-2.2.11","II-2.2.12","II-2.2.13","II-2.2.14","II-2.2.15","II-2.2.16","II-2.2.17","II-2.2.18","II-2.3.1 ","II-2.3.2 ","MEDIA BASICA ","II-3.1.1 ","II-3.1.2 ","II-3.2.1 ","II-3.2.2","II-3.2.3","II-3.2.4","II-3.2.5","II-3.2.6","II-3.2.7","II-3.2.8 ","II-3.3.1 ","II-3.3.2","II-3.4.1","MEDIA SUPERIOR ","II-4.1.1 ","II-4.2.1 ","II-4.2.2 ","II-4.2.3 ","II-4.2.4 ","II-4.2.5","II-4.2.6","II-4.2.7 ","II-4.2.8","II-4.2.9 ","II-4.2.10","II-4.2.11","II-4.3.1 ","II-4.3.2","II-4.4.1","TERCIARIA NO UNIVERSITARIA","II-5.1.1  ","II-5.2.1 ","II-5.2.2","II-5.3.1 ","II-5.3.2 ","FORMACIÓN EN EDUCACIÓN  ","II-6.1.1","II-6.2.1","II-6.2.2","II-6.3.1","II-6.3.2","II-6.3.3","EDUCACIÓN UNIVERSITARIA","II-7.1.1   ","II-7.1.2 ","II-7.2.1 ","II-7.2.2  ","II-7.2.3 ","II-7.2.4  ","II-7.2.5","II-7.2.6 ","II-7.2.7  ","II-7.2.8","II-7.3.1 ","EDUCACIÓN DE JÓVENES Y ADUL "," II-8.1.1"," II-8.1.2","II-8.1.3","II-8.1.4","II-8.1.5.","II-8.1.6","II-8.1.7","II-8.1.8  ","II-8.1.9  ","II-8.1.10  ","II-8.2.1  ","ll-8.2.2","II-8.3.1   ","II-8.4.1  ","II-8.4.2","CONTROL","CONTROL ","CONTROL Media Básica","CONTROL Media Superior"],"not_rendered":{"charts":0,"images":17,"macros":1,"external_links":1,"defined_names":722,"comments":0,"pivot_tables":0},"unopened":[],"bounds":{"document_bytes":16777216,"sheet_cells":100000,"rows_first":2000,"rows_last":500,"rows_between":2000,"halvings":0,"cell_chars":16384,"cell_head_chars":4096},"cells_cut":0,"cells_raw":0,"read":"whole","date_system":"1900"}

{"sheet":"PRESENTACION","index":0,"n_rows":0,"n_cols":0,"rows_kept":0,"cut":false,"hidden":false,"merged":[]}

{"sheet":"ESTADÍSTICAS BÁSICAS","index":1,"n_rows":16,"n_cols":6,"rows_kept":16,"cut":false,"hidden":false,"merged":[[15,5,15,7],[2,1,4,7],[11,2,11,3],[13,2,13,3],[15,2,15,3],[9,2,9,4],[9,5,9,7],[11,5,11,7],[13,5,13,7]]}
[]
[]
[null,"ESTADÍSTICAS BÁSICAS"]
[]
[]
[]
[]
[]
[]
[null,null,"PRIMERA INFANCIA E INICIAL",null,null,"TERCIARIA NO UNIVERSITARIA"]
[]
[null,null,"PRIMARIA",null,null,"FORMACIÓN EN EDUCACIÓN"]
[]
[null,null,"MEDIA BÁSICA",null,null,"EDUCACIÓN UNIVERSITARIA"]
[]
[null,null,"MEDIA SUPERIOR",null,null,"EDUCACIÓN DE JÓVENES Y ADULTOS"]

{"sheet":"PRIMERA INFANCIA E INICIAL ","index":2,"n_rows":33,"n_cols":2,"rows_kept":33,"cut":false,"hidden":false,"merged":[]}
[]
[]
[]
[]
[]
[]
[null,"ESTABLECIMIENTOS"]
["Cuadro Nº II-1.1.1  ","CANTIDAD DE ESTABLECIMIENTOS DE EDUCACIÓN EN LA PRIMERA INFANCIA E INICIAL DEL CEIP POR FORMA DE ADMINISTRACIÓN Y MODALIDAD SEGÚN DEPARTAMENTO. (Todo el país, 2017)"]
[""]
["Cuadro Nº  II-1.1.2 ","CANTIDAD DE ESTABLECIMIENTOS DE PRIMERA INFANCIA E INICIAL DEL MEC E INAU POR FORMA DE ADMINISTRACIÓN SEGÚN DEPARTAMENTO. (Todo el país, 2017). "]
[""]
[""]
["Cuadro Nº II-1.2.1  ","ESTUDIANTES MATRICULADOS EN EDUCACIÓN EN LA PRIMERA INFANCIA E INICIAL POR FORMA DE ADMINISTRACIÓN, MODALIDAD Y SEXO SEGÚN DEPARTAMENTO. (Todo el país, 2017)"]
[""]
["Cuadro Nº II-1.2.2  ","ESTUDIANTES MATRICULADOS EN EDUCACIÓN PÚBLICA EN LA PRIMERA INFANCIA E INICIAL DEL CEIP POR  MODALIDAD Y EDAD SEGÚN DEPARTAMENTO. (Todo el país, 2017)"]
[""]
["Cuadro Nº II-1.2.3  "," ESTUDIANTES MATRICULADOS EN EDUCACIÓN EN LA PRIMERA INFANCIA E INICIAL PRIVADA POR MODALIDAD Y NIVEL SEGÚN DEPARTAMENTO.  (Todo el país, 2017)."]
[""]
["Cuadro Nº II-1.2.4  ","ESTUDIANTES MATRICULADOS EN EDUCACIÓN EN LA PRIMERA INFANCIA E INICIAL  POR FORMA DE ADMINISTRACIÓN Y SEXO SEGÚN DEPARTAMENTO.  (Todo el país, 2017)."]
[""]
["Cuadro Nº II-1.2.5  "," ESTUDIANTES MATRICULADOS EN EDUCACIÓN EN LA PRIMERA INFANCIA E INICIAL  POR FORMA DE ADMINISTRACIÓN SEGÚN EDAD.  (Todo el país, 2017)."]
[""]
["Cuadro Nº II-1.2.6  "," ESTUDIANTES MATRICULADOS EN EDUCACIÓN EN LA PRIMERA INFANCIA E INICIAL PÚBLICA DEL CEIP POR ÁREA DEMOGRÁFICA SEGÚN DEPARTAMENTO.  (Todo el país, 2017)."]
[""]
["Cuadro Nº II-1.2.7  "," ESTUDIANTES MATRICULADOS EN EDUCACIÓN EN LA PRIMERA INFANCIA E INICIAL  EN CENTROS PRIVADOS HABILITADOS POR EL MEC POR EDAD SEGÚN DEPARTAMENTO. (Todo el país, 2017)."]
[""]
[""]
["Cuadro Nº II-1.3.1  "," PERSONAL DOCENTE DE EDUCACIÓN EN LA PRIMERA INFANCIA E INICIAL  PÚBLICA DEL CEIP SEGÚN DEPARTAMENTO.  (Todo el país, 2017)."]
[""]
["Cuadro Nº II-1.3.2  ","PERSONAL DOCENTE DE EDUCACIÓN EN LA PRIMERA INFANCIA E INICIAL PRIVADA SEGÚN DEPARTAMENTO. (Todo el país, 2017)."]
[""]
["Cuadro Nº II-1.3.3  "," PERSONAL DOCENTE EN EDUCACIÓN EN LA PRIMERA INFANCIA PRIVADA SUPERVISADA POR EL MEC SEGÚN FUNCIÓN Y DEPARTAMENTO.  (Todo el país, 2017).   "]
[""]

{"sheet":" II-1.1.1","index":3,"n_rows":33,"n_cols":9,"rows_kept":33,"cut":false,"hidden":false,"merged":[[7,7,9,7],[7,8,9,8],[0,6,1,8],[4,0,4,8],[5,0,9,0],[5,1,9,1],[5,2,5,8],[6,2,6,6],[7,2,9,2],[7,3,9,3],[7,5,9,5],[7,6,9,6],[7,4,9,4]]}
["CONSEJO DE EDUCACIÓN INICIAL Y PRIMARIA",null,null,null,null,null,"ESTABLECIMIENTOS"]
[]
["Cuadro Nº II-1.1.1",null,null,null,null,null,null,null,"VOLVER"]
[]
["CANTIDAD DE ESTABLECIMIENTOS DE EDUCACIÓN EN LA PRIMERA INFANCIA E INICIAL DEL CEIP POR FORMA DE ADMINISTRACIÓN Y MODALIDAD SEGÚN DEPARTAMENTO (Todo el país, 2017)"]
["DEPARTAMENTO","TOTAL","FORMA DE ADMINISTRACIÓN"]
[null,null,"PÚBLICA",null,null,null,null,null,"PRIVADA"]
[null,null,"Total Público","Jardines de Infantes","Aprender","JICI","Inicial","Jardines de Tiempo Completo","Jardines de Infantes"]
[]
[]
["TOTAL",{"$f":"+B12+B13","v":233},{"$f":"+C12+C13","v":193},{"$f":"SUM(D12:D13)","v":111},{"$f":"E12+E13","v":21},{"$f":"SUM(F12:F13)","v":2},{"$f":"SUM(G12:G13)","v":1},{"$f":"SUM(H12:H13)","v":58},{"$f":"SUM(I12:I13)","v":40}]
["MONTEVIDEO",{"$f":"+C12+I12","v":88},{"$f":"+D12++E12+F12+G12+H12","v":63},29,13,1,0,20,25]
["RESTO DEL PAÍS",{"$f":"+C13+I13","v":145},{"$f":"+D13+E13+F13+G13+H13","v":130},{"$f":"SUM(D15:D32)","v":82},8,1,1,38,15]
[]
["Artigas",{"$f":"+C15+I15","v":7},{"$f":"+D15+E15+F15+G15+H15","v":4},2,1,0,1,0,3]
["Canelones",{"$f":"+C16+I16","v":34},{"$f":"+D16+E16+F16+G16+H16","v":34},26,4,0,0,4,0]
["Cerro Largo",7,7,2,1,1,0,3,0]
["Colonia",6,6,5,0,0,0,1,0]
["Durazno",5,5,3,0,0,0,2,0]
["Flores",3,2,1,0,0,0,1,1]
["Florida",4,4,2,0,0,0,2,0]
["Lavalleja",9,7,4,0,0,0,3,2]
["Maldonado",8,7,7,0,0,0,0,1]
["Paysandú",4,4,2,0,0,0,2,0]
["Río Negro",6,6,2,0,0,0,4,0]
["Rivera",7,7,3,0,0,0,4,0]
["Rocha",12,7,5,0,0,0,2,5]
["Salto",6,5,3,1,0,0,1,1]
["San José",6,6,3,1,0,0,2,0]
["Soriano",7,5,4,0,0,0,1,2]
["Tacuarembó",{"$f":"+C31+I31","v":9},9,6,0,0,0,3,0]
["Treinta y Tres",{"$f":"+C32+I32","v":5},5,2,0,0,0,3,0]
["Fuente: Procesamiento propio en base a datos proporcionados por el D.E.E. — C.E.I.P."]

{"sheet":"II-1.1.2","index":4,"n_rows":38,"n_cols":5,"rows_kept":38,"cut":false,"hidden":false,"merged":[[35,0,36,4],[0,4,1,5],[1,0,1,2],[5,0,5,4],[6,0,9,0],[6,2,6,4],[7,1,9,1],[7,2,9,2],[7,3,9,3],[7,4,9,4]]}
["MINISTERIO DE EDUCACIÓN Y CULTURA",null,null,null,"Establecimientos"]
["Dirección de Educación "]
[]
["Cuadro Nº  II-1.1.2"]
[]
["CANTIDAD DE ESTABLECIMIENTOS DE PRIMERA INFANCIA E INICIAL DEL MEC E INAU POR FORMA DE ADMINISTRACIÓN SEGÚN DEPARTAMENTO(Todo el país, 2017)"]
["DEPARTAMENTO"]
[null,"TOTAL","CAIF","DIURNOS-INAU","PRIVADOS"]
[]
[]
["TOTAL",{"$f":"C11+D11+E11","v":782},{"$f":"C12+C13","v":408},{"$f":"D12+D13","v":52},{"$f":"E12+E13","v":322}]
["MONTEVIDEO",308,87,26,195]
["RESTO DEL PAÍS",{"$f":"C13+D13+E13","v":474},{"$f":"SUM(C15:C32)","v":321},{"$f":"SUM(D15:D32)","v":26},{"$f":"SUM(E15:E32)","v":127}]
[]
["Artigas",{"$f":"C15+D15+E15","v":22},17,2,3]
["Canelones",122,65,2,55]
["Cerro Largo",21,20,0,1]
["Colonia",30,15,2,13]
["Durazno",20,16,2,2]
["Flores",9,6,2,1]
["Florida",18,12,2,4]
["Lavalleja",14,8,1,5]
["Maldonado",21,12,2,7]
["Paysandú",32,25,1,6]
["Río Negro",15,12,1,2]
["Rivera",22,16,1,5]
["Rocha",19,15,1,3]
["Salto",27,24,1,2]
["San José",22,13,2,7]
["Soriano",24,15,1,8]
["Tacuarembó",23,18,2,3]
["Treinta y Tres",13,12,1,0]
["Fuente: Procesamiento propio en base a datos proporcionados por:"]
["Registro Nacional de Centros Educativos en la Primera Infancia. MEC"]
["Nota:  Privados supervisados por el MEC"]
["Dentro del total de Centros Diurnos, se suman 17 Centros correspondientes a Proyecto  Nuestros Niños de la Intendencia Municipal de Montevideo."]
[]
["Para CAIF Y CENTROS DIURNOS: SIPI de INAU."]

{"sheet":"II-1.2.1","index":5,"n_rows":35,"n_cols":43,"rows_kept":35,"cut":false,"hidden":false,"merged":[[8,1,10,1],[7,5,7,14],[7,16,7,37],[8,16,8,17],[8,18,8,19],[8,20,8,21],[8,22,8,23],[8,24,8,25],[8,26,8,27],[8,28,8,29],[8,30,8,31],[8,32,8,33],[8,34,8,35],[8,36,8,37],[8,5,8,6],[8,7,8,8],[7,39,7,40],[7,41,7,42],[9,39,9,40],[9,41,9,42],[8,9,8,10],[8,11,8,12],[8,13,8,14],[9,16,9,17],[9,18,9,19],[0,39,1,42],[4,0,4,42],[5,0,9,0],[5,1,5,42],[6,1,7,3],[6,4,6,37],[6,38,6,42],[7,4,10,4],[9,36,9,37],[7,38,10,38],[9,2,9,3],[9,30,9,31],[9,34,9,35],[9,5,9,6],[9,9,9,10],[9,11,9,12],[9,7,9,8],[9,26,9,27],[9,28,9,29],[9,32,9,33],[9,13,9,14],[9,20,9,21],[9,22,9,23],[9,24,9,25]]}
["CONSEJO DE EDUCACIÓN INICIAL Y PRIMARIA",null,null,null,null,null,null,null,null,null,null,null,null,null,null,null,null,null,null,null,null,null,null,null,null,null,null,null,null,null,null,null,null,null,null,null,null,null,null,"ALUMNOS MATRICULADOS"]
[]
["Cuadro Nº II-1.2.1"]
[]
["ESTUDIANTES MATRICULADOS EN EDUCACIÓN EN LA PRIMERA INFANCIA E INICIAL POR FORMA DE ADMINISTRACIÓN, MODALIDAD Y SEXO SEGÚN DEPARTAMENTO (Todo el país, 2017)"]
["DEPARTAMENTO","FORMA DE ADMINISTRACIÓN"]
[null,"TOTAL",null,null,"PÚBLICA",null,null,null,null,null,null,null,null,null,null,null,null,null,null,null,null,null,null,null,null,null,null,null,null,null,null,null,null,null,null,null,null,null,"PRIVADA"]
[null,null,null,null,"Total Público","Educación Inicial",null,null,null,null,null,null,null,null,null,null,"Inicial en Escuelas",null,null,null,null,null,null,null,null,null,null,null,null,null,null,null,null,null,null,null,null,null,"Total Privada","Jardines de Infantes",null,"Inicial en Colegios"]
[null,"TOTAL",null,null,null,"INICIAL",null,"JARDÍN APRENDER",null,"JARDÍN COMÚN",null,"JARDÍN DE CICLO INICIAL",null,"JARDÍN DE JORNADA COMPLETA",null,null,"APRENDER",null,"APRENDER  H. DE PRÁCTICA",null,"COMÚN",null,"CON MAESTRO A CARGO",null,"DE PRÁCTICA",null,"DE TIEMPO COMPLETO",null,"HABILITADA DE PRÁCTICA",null,"INTERNADO RURAL",null,"T.EXTENDIDO-DE PRÁCTICA",null,"TIEMPO EXTENDIDO",null,"UNIDOCENTE"]
[null,null,"SEXO",null,null,"SEXO",null,"SEXO",null,"SEXO",null,"SEXO",null,"SEXO",null,null,"SEXO",null,"SEXO",null,"SEXO",null,"SEXO",null,"SEXO",null,"SEXO",null,"SEXO",null,"SEXO",null,"SEXO",null,"SEXO",null,"SEXO",null,null,"SEXO",null,"SEXO"]
[null,null,"VARÓN","MUJER",null,"V","M","V","M","V","M","V","M","V","M",null,"V","M","V","M","V","M","V","M","V","M","V","M","V","M","V","M","V","M","V","M","V","M",null,"V","M","V","M"]
["TOTAL",{"$f":"+B13+B14","v":115320},{"$f":"+C13+C14","v":58773},{"$f":"+D13+D14","v":56547},{"$f":"+E13+E14","v":86572},{"$f":"F13+F14","v":83},{"$f":"G13+G14","v":94},2538,2353,11860,11710,291,286,{"$f":"N13+N14","v":4434},{"$f":"O13+O14","v":4283},null,{"$f":"Q13+Q14","v":6958},{"$f":"R13+R14","v":6525},{"$f":"S13+S14","v":295},{"$f":"T13+T14","v":300},{"$f":"U13+U14","v":6300},{"$f":"V13+V14","v":6181},{"$f":"W13+W14","v":1381},{"$f":"X13+X14","v":1320},{"$f":"Y13+Y14","v":1417},{"$f":"Z13+Z14","v":1295},{"$f":"AA13+AA14","v":4778},4435,2269,2114,{"$f":"+AE13+AE14","v":9},{"$f":"AF13+AF14","v":13},{"$f":"AG14+AG13","v":15},{"$f":"AH13+AH14","v":13},{"$f":"AI13+AI14","v":889},{"$f":"AJ13+AJ14","v":851},{"$f":"+AK13+AK14","v":659},{"$f":"AL13+AL14","v":623},{"$f":"+AM13+AM14","v":28748},{"$f":"+AN13+AN14","v":2089.0000000000005},{"$f":"+AO13+AO14","v":1965},{"$f":"+AP13+AP14","v":12508},{"$f":"+AQ13+AQ14","v":12186}]
["MONTEVIDEO",{"$f":"E13+AM13","v":44312},{"$f":"F13+H13+J13+L13+N13+Q13+S13+U13+W13+Y13+AA13+AC13+AE13+AG13+AI13+AK13+AN13+AP13","v":22763},{"$f":"G13+I13+K13+M13+O13+R13+T13+V13+X13+Z13+AB13+AD13+AF13+AH13+AJ13+AL13+AO13+AQ13","v":21549},{"$f":"SUM(F13:AL13)","v":26578},0,0,1705,1539,3522,3328,175,182,1951,1963,null,2624,2368,0,0,1518,1462,0,0,392,330,1275,1152,275,240,0,0,0,0,291,286,0,0,{"$f":"+AN13+AO13+AP13+AQ13","v":17734},1565.0000000000005,1408,7470,7291.0000000000009]
["RESTO DEL PAÍS",{"$f":"SUM(B16:B33)","v":71008},{"$f":"SUM(C16:C33)","v":36010},34998,{"$f":"SUM(F14:AL14)","v":59994},{"$f":"SUM(F16:F33)","v":83},94,833,814,8338,8382,116,104,2483,2320,null,4334,4157,295,300,4782,4719,1381,1320,1025,965,3503,3283,1994,1874,9,13,15,13,598,{"$f":"SUM(AJ16:AJ33)","v":565},659,623,11014,{"$f":"SUM(AN16:AN33)","v":524},{"$f":"SUM(AO16:AO33)","v":557},5038,4895]
[]
["Artigas",{"$f":"E16+AM16","v":2724},{"$f":"F16+H16+J16+L16+N16+Q16+S16+U16+W16+Y16+AA16+AC16+AE16+AG16+AI16+AK16+AN16+AP16","v":1363},{"$f":"G16+I16+K16+M16+O16+R16+T16+V16+X16+Z16+AB16+AD16+AF16+AH16+AJ16+AL16+AO16+AQ16","v":1361},{"$f":"SUM(F16:AL16)","v":2507},83,94,97,89,227,199,0,0,0,0,null,294,304,0,0,93,84,68,83,0,0,221,234,130,131,2,4,0,0,18,13,28,11,{"$f":"+AN16+AO16+AP16+AQ16","v":217},0,0,102,115]
["Canelones",18004,{"$f":"F17+H17+J17+L17+N17+Q17+S17+U17+W17+Y17+AA17+AC17+AE17+AG17+AI17+AK17+AN17+AP17","v":9143},8861,{"$f":"SUM(F17:AL17)","v":14466},0,0,391,376,2947,2962,0,0,337,320,null,1140,1080,0,0,913,891,252,246,128,99,784,762,333,290,3,3,0,0,56,60,50,43,3538,105,113,1703.9999999999998,1616]
["Cerro Largo",3026,1496,1530,{"$f":"SUM(F18:AL18)","v":2787},0,0,140,155,133,152,116,104,148,154,null,213,203,42,28,92,95,60,68,53,56,139,138,154,155,0,0,0,0,52,47,41,49,239,0,0,113.00000000000001,126]
["Colonia",4465,2258,2207,{"$f":"SUM(F19:AL19)","v":3865},0,0,0,0,484,444,0,0,46,56,null,29,26,0,0,701,739,87,83,100,111,193,183,178,166,0,0,0,0,63,51,70,55,600,0,0,307,293]
["Durazno",1991,999,992,1752,0,0,0,0,256,263,0,0,76,70,null,80,94,0,0,103,109,23,18,69,71,134,134,86,87,0,0,0,0,16,12,30,21,239,0,0,126,113]
["Flores",872,454,418,775,0,0,0,0,77,73,0,0,49,60,null,0,0,0,0,113,84,14,19,29,23,71,58,19,18,0,0,0,0,14,11,22,21,97,0,0,46,51]
["Florida",2175,1075,1100,2013,0,0,0,0,252,271,0,0,95,76,null,53,52,0,0,197,210,78,72,33,38,107,98,89,97,0,0,0,0,52,58,39,46,162,16,15,64,67]
["Lavalleja",1901,944,957,1577,0,0,0,0,256,305,0,0,191,136,null,0,0,17,14,128,147,20,19,17,25,65,65,52,50,0,0,0,0,0,0,34,36,324,0,0,164,160]
["Maldonado",6015,3012,3003,4366,0,0,0,0,819,802,0,0,0,0,null,210,287,0,0,441,480,54,50,70,65,233,226,272,241,0,0,0,0,33,28,32,23,1648.9999999999998,58,56,789.99999999999989,744.99999999999989]
["Paysandú",3917,2010,1907,3434,0,0,0,0,264,243,0,0,161,133,null,309,301,143,159,334,328,102,69,97,81,213,176,79,72,1,3,0,0,38,44,35,49,483,57,65,177.00000000000003,184]
["Río Negro",2150,1133,1017,1866,0,0,0,0,181,208,0,0,280,258,null,26,22,0,0,202,188,47,42,40,35,92,80,44,31,3,3,0,0,33,16,16,19,284,0,0,169,114.99999999999999]
["Rivera",3709,1864,1845,3429,0,0,0,0,327,348,0,0,252,257,null,464,413,93,99,122,131,91,82,91,97,150,147,71,65,0,0,0,0,26,26,38,39,280,0,0,139,141]
["Rocha",2508,1246,1262,2225,0,0,0,0,344,363,0,0,106,125,null,126,122,0,0,246,240,25,20,42,36,169,174,0,0,0,0,15,13,0,0,24,35,283,0,0,149,134]
["Salto",5509,2816,2693,4488,0,0,69,71,395,415,0,0,181,169,null,542,480,0,0,179,152,171,158,34,26,411,374,251,268,0,0,0,0,45,38,32,27,1021,188,167,318,348]
["San José",4117,2120,1997,3566,0,0,136,123,327,313,0,0,203,193,null,394,356,0,0,293,277,123,121,36,32,179,149,45,29,0,0,0,0,75,79,34,49,551,45,70,230.00000000000003,206]
["Soriano",2689,1372,1317,2439,0,0,0,0,366,373,0,0,32,42,null,160,164,0,0,277,242,34,26,71,65,149,123,117,112,0,0,0,0,0,0,48,38,250,0,0,118,132]
["Tacuarembó",3497,1772,1725,2828,0,0,0,0,456,458,0,0,133,100,null,203,192,0,0,210,204,110,118,65,51,133,109,43,32,0,0,0,0,59,58,53,41,669,55,71,252,291]
["Treinta y Tres",1739,933,806,1611,0,0,0,0,227,190,0,0,193,171,null,91,61,0,0,138,118,22,26,50,54,60,53,31,30,0,0,0,0,18,24,33,21,128,0,0,70,58]
["Fuente: Procesamiento propio en base a datos proporcionados por el D.E.E. — C.E.I.P."]
["Privados habilitados o autorizados por ANEP"]

{"sheet":"II-1.2.2","index":6,"n_rows":33,"n_cols":81,"rows_kept":33,"cut":false,"hidden":false,"merged":[[7,32,7,35],[1,8,2,11],[5,1,5,79],[4,0,4,79],[0,72,1,79],[7,57,7,60],[7,67,7,70],[7,72,7,75],[5,0,9,0],[7,2,7,5],[8,2,8,5],[8,57,8,60],[7,62,7,65],[8,62,8,65],[6,1,9,1],[6,2,6,25],[6,27,6,79],[7,76,7,80],[8,76,8,80],[7,42,7,45],[8,42,8,45],[7,47,7,50],[8,47,8,50],[8,52,8,55],[8,67,8,70],[8,72,8,75],[7,52,7,55],[8,32,8,35],[7,37,7,40],[8,37,8,40],[7,27,7,30],[8,27,8,30],[7,22,7,25],[8,22,8,25],[7,7,7,10],[8,7,8,10],[7,12,7,15],[8,12,8,15],[7,17,7,20],[8,17,8,20]]}
["CONSEJO DE EDUCACIÓN INICIAL Y PRIMARIA"]
[null,null,null,null,null,null,null,null,"ESTUDIANTES MATRICULADOS"]
["Cuadro Nº II-1.2.2"]
[null,null,null,null,null,null,null,null,null,null,null,null,null,null,null,null,null,null,null,null,null,null,null,null,null,null,null,null,null,null,null,null,null,null,null,null,null,null,null,null,null,null,null,null,null,null,null,null,null,null,null,null,null,null,null,null,null,null,null,null,null,null,null,null,null,null,null,null,null,null,null,null,null,null,null,null,null,null,null,"VOLVER"]
["ESTUDIANTES MATRICULADOS EN EDUCACIÓN PÚBLICA EN LA PRIMERA INFANCIA E INICIAL DEL CEIP POR  MODALIDAD Y EDAD SEGÚN DEPARTAMENTO (Todo el país, 2017)"]
["DEPARTAMENTO","PÚBLICA"]
[null,"Total Público","EDUCACIÓN DE INICIAL",null,null,null,null,null,null,null,null,null,null,null,null,null,null,null,null,null,null,null,null,null,null,null,null,"INICIAL EN ESCUELAS"]
[null,null,"INICIAL",null,null,null,null,"JARDÍN APRENDER",null,null,null,null,"JARDÍN COMÚN",null,null,null,null,"JARDÍN DE CICLO INICIAL",null,null,null,null,"JARDÍN DE JORNADA COMPLETA",null,null,null,null,"APRENDER",null,null,null,null,"APRENDER  H. DE PRÁCTICA",null,null,null,null,"COMÚN",null,null,null,null,"CON MAESTRO A CARGO",null,null,null,null,"DE PRÁCTICA",null,null,null,null,"DE TIEMPO COMPLETO",null,null,null,null,"HABILITADA DE PRÁCTICA",null,null,null,null,"INTERNADO RURAL",null,null,null,null,"T.EXTENDIDO-DE PRÁCTICA",null,null,null,null,"TIEMPO EXTENDIDO",null,null,null,"UNIDOCENTE"]
[null,null,"AÑOS",null,null,null,null,"AÑOS",null,null,null,null,"AÑOS",null,null,null,null,"AÑOS",null,null,null,null,"AÑOS",null,null,null,null,"AÑOS",null,null,null,null,"AÑOS",null,null,null,null,"AÑOS",null,null,null,null,"AÑOS",null,null,null,null,"AÑOS",null,null,null,null,"AÑOS",null,null,null,null,"AÑOS",null,null,null,null,"AÑOS",null,null,null,null,"AÑOS",null,null,null,null,"AÑOS",null,null,null,"AÑOS"]
[null,null,"<= 2 ",3,4,5,null,"<= 2 ",3,4,5,null,"<= 2 ",3,4,5,null,"<= 2 ",3,4,5,null,"<= 2 ",3,4,5,null,"<= 2 ",3,4,5,null,"<= 2 ",3,4,5,null,"<= 2 ",3,4,5,null,"<= 2 ",3,4,5,null,"<= 2 ",3,4,5,null,"<= 2 ",3,4,5,null,"<= 2 ",3,4,5,null,"<= 2 ",3,4,5,null,"<= 2 ",3,4,5,null,"<= 2 ",3,4,5,null,"<= 2 ",3,4,5]
["TOTAL",{"$f":"+B12+B13","v":86572},{"$f":"C12+C13","v":0},{"$f":"D12+D13","v":52},{"$f":"E12+E13","v":51},{"$f":"F12+F13","v":74},null,{"$f":"H12+H13","v":0},{"$f":"I12+I13","v":1040},{"$f":"J12+J13","v":1966},{"$f":"K12+K13","v":1885},null,{"$f":"M12+M13","v":2},{"$f":"N12+N13","v":7428},{"$f":"O12+O13","v":8920},{"$f":"P12+P13","v":7220},null,{"$f":"R12+R13","v":0},{"$f":"S12+S13","v":161},{"$f":"T12+T13","v":217},{"$f":"U12+U13","v":199},null,{"$f":"W12+W13","v":101},{"$f":"X12+X13","v":2493},{"$f":"Y12+Y13","v":3253},{"$f":"Z12+Z13","v":2870},null,{"$f":"AB12+AB13","v":1},{"$f":"AC12+AC13","v":470},{"$f":"AD12+AD13","v":6432},{"$f":"AE12+AE13","v":6580},null,{"$f":"AG12+AG13","v":0},{"$f":"AH12+AH13","v":46},{"$f":"AI12+AI13","v":276},{"$f":"AJ12+AJ13","v":273},null,{"$f":"AL12+AL13","v":0},{"$f":"AM12+AM13","v":720},{"$f":"AN12+AN13","v":5345},{"$f":"AO12+AO13","v":6416},null,{"$f":"AQ12+AQ13","v":1},{"$f":"AR12+AR13","v":301},{"$f":"AS12+AS13","v":1186},{"$f":"AT12+AT13","v":1213},null,{"$f":"AV12+AV13","v":0},{"$f":"AW12+AW13","v":49},{"$f":"AX12+AX13","v":1119},{"$f":"AY12+AY13","v":1544},null,{"$f":"BA12+BA13","v":0},{"$f":"BB12+BB13","v":228},{"$f":"BC12+BC13","v":4281},{"$f":"BD12+BD13","v":4704},null,{"$f":"BF12+BF13","v":1},{"$f":"BG12+BG13","v":241},{"$f":"BH12+BH13","v":1981},{"$f":"BI12+BI13","v":2160},null,{"$f":"BK12+BK13","v":0},{"$f":"BL12+BL13","v":0},{"$f":"BM12+BM13","v":10},{"$f":"BN12+BN13","v":12},null,{"$f":"+BP12+BP13","v":0},{"$f":"BQ12+BQ13","v":0},{"$f":"BR12+BR13","v":247},{"$f":"BS12+BS13","v":290},null,{"$f":"BU13+BU12","v":0},{"$f":"BV13+BV12","v":64},{"$f":"BW13+BW12","v":533},{"$f":"BX13+BX12","v":634},null,{"$f":"BZ12+BZ13","v":0},{"$f":"CA12+CA13","v":151},{"$f":"CB12+CB13","v":571},{"$f":"CC12+CC13","v":560}]
["MONTEVIDEO",{"$f":"SUM(C12:CC12)","v":26578},0,0,0,0,null,0,708,1309,1227,null,0,1990,2548,2312,null,0,88,136,133,null,101,1098,1410,1305,null,1,96,2403,2492,null,0,0,0,0,null,0,117,1232,1631,null,0,0,0,0,null,0,25,308,389,null,0,23,1070,1334,null,0,65,222,228,null,0,0,0,0,null,0,0,137,160,null,0,0,95,185,null,0,0,0,0]
["RESTO DEL PAÍS",{"$f":"SUM(B15:B32)","v":59994},{"$f":"SUM(C15:C32)","v":0},{"$f":"SUM(D15:D32)","v":52},{"$f":"SUM(E15:E32)","v":51},{"$f":"SUM(F15:F32)","v":74},null,{"$f":"SUM(H15:H32)","v":0},{"$f":"SUM(I15:I32)","v":332},{"$f":"SUM(J15:J32)","v":657},{"$f":"SUM(K15:K32)","v":658},null,{"$f":"SUM(M15:M32)","v":2},{"$f":"SUM(N15:N32)","v":5438},{"$f":"SUM(O15:O32)","v":6372},{"$f":"SUM(P15:P32)","v":4908},null,{"$f":"SUM(R15:R32)","v":0},{"$f":"SUM(S15:S32)","v":73},{"$f":"SUM(T15:T32)","v":81},{"$f":"SUM(U15:U32)","v":66},null,{"$f":"SUM(W15:W32)","v":0},{"$f":"SUM(X15:X32)","v":1395},{"$f":"SUM(Y15:Y32)","v":1843},{"$f":"SUM(Z15:Z32)","v":1565},null,{"$f":"SUM(AB15:AB32)","v":0},{"$f":"SUM(AC15:AC32)","v":374},{"$f":"SUM(AD15:AD32)","v":4029},{"$f":"SUM(AE15:AE32)","v":4088},null,{"$f":"SUM(AG15:AG32)","v":0},{"$f":"SUM(AH15:AH32)","v":46},{"$f":"SUM(AI15:AI32)","v":276},{"$f":"SUM(AJ15:AJ32)","v":273},null,{"$f":"SUM(AL15:AL32)","v":0},{"$f":"SUM(AM15:AM32)","v":603},{"$f":"SUM(AN15:AN32)","v":4113},{"$f":"SUM(AO15:AO32)","v":4785},null,{"$f":"SUM(AQ15:AQ32)","v":1},{"$f":"SUM(AR15:AR32)","v":301},{"$f":"SUM(AS15:AS32)","v":1186},{"$f":"SUM(AT15:AT32)","v":1213},null,{"$f":"SUM(AV15:AV32)","v":0},{"$f":"SUM(AW15:AW32)","v":24},{"$f":"SUM(AX15:AX32)","v":811},{"$f":"SUM(AY15:AY32)","v":1155},null,{"$f":"SUM(BA15:BA32)","v":0},{"$f":"SUM(BB15:BB32)","v":205},{"$f":"SUM(BC15:BC32)","v":3211},{"$f":"SUM(BD15:BD32)","v":3370},null,{"$f":"SUM(BF15:BF32)","v":1},{"$f":"SUM(BG15:BG32)","v":176},{"$f":"SUM(BH15:BH32)","v":1759},{"$f":"SUM(BI15:BI32)","v":1932},null,{"$f":"SUM(BK15:BK32)","v":0},{"$f":"SUM(BL15:BL32)","v":0},{"$f":"SUM(BM15:BM32)","v":10},{"$f":"SUM(BN15:BN32)","v":12},null,{"$f":"SUM(BP15:BP32)","v":0},{"$f":"SUM(BQ15:BQ32)","v":0},110,130,null,{"$f":"SUM(BU15:BU32)","v":0},{"$f":"SUM(BV15:BV32)","v":64},438,449,null,0,{"$f":"SUM(CA15:CA32)","v":151},{"$f":"SUM(CB15:CB32)","v":571},{"$f":"SUM(CC15:CC32)","v":560}]
[]
["Artigas",{"$f":"SUM(C15:CC15)","v":2507},0,52,51,74,null,0,47,76,63,null,0,119,156,151,null,0,0,0,0,null,0,0,0,0,null,0,15,315,268,null,0,0,0,0,null,0,0,86,91,null,0,12,67,72,null,0,0,0,0,null,0,0,212,243,null,1,0,131,129,null,0,0,3,3,null,0,0,0,0,null,0,0,11,20,null,0,9,20,10]
["Canelones",{"$f":"SUM(C16:CC16)","v":14466},0,0,0,0,null,0,140,303,324,null,2,1725,2229,1953,null,0,0,0,0,null,0,181,242,234,null,0,23,1104,1093,null,0,0,0,0,null,0,0,874,930,null,0,19,247,232,null,0,0,103,124,null,0,25,745,776,null,0,65,258,300,null,0,0,1,5,null,0,0,0,0,null,0,0,51,65,null,0,22,38,33]
["Cerro Largo",2787,0,0,0,0,null,0,71,107,117,null,0,71,107,107,null,0,73,81,66,null,0,82,130,90,null,0,62,180,174,null,0,0,30,40,null,0,0,85,102,null,0,21,62,45,null,0,0,50,59,null,0,33,113,131,null,0,0,149,160,null,0,0,0,0,null,0,0,0,0,null,0,5,42,52,null,0,11,38,41]
["Colonia",3865,0,0,0,0,null,0,0,0,0,null,0,426,320,182,null,0,0,0,0,null,0,40,37,25,null,0,12,20,23,null,0,0,0,0,null,0,196,605,639,null,0,18,74,78,null,0,0,81,130,null,0,0,189,187,null,0,0,174,170,null,0,0,0,0,null,0,0,17,23,null,0,0,37,37,null,0,9,56,60]
["Durazno",1752,0,0,0,0,null,0,0,0,0,null,0,142,220,157,null,0,0,0,0,null,0,28,71,47,null,0,1,89,84,null,0,0,0,0,null,0,18,109,85,null,0,0,26,15,null,0,0,54,86,null,0,28,117,123,null,0,15,84,74,null,0,0,0,0,null,0,0,0,0,null,0,0,13,15,null,0,0,29,22]
["Flores",775,0,0,0,0,null,0,0,0,0,null,0,49,50,51,null,0,0,0,0,null,0,41,50,18,null,0,0,0,0,null,0,0,0,0,null,0,42,68,87,null,0,8,12,13,null,0,0,25,27,null,0,17,61,51,null,0,0,21,16,null,0,0,0,0,null,0,0,0,0,null,0,0,16,9,null,0,14,17,12]
["Florida",2013,0,0,0,0,null,0,0,0,0,null,0,224,231,68,null,0,0,0,0,null,0,52,56,63,null,0,0,45,60,null,0,0,0,0,null,0,25,142,240,null,0,26,69,55,null,0,0,0,71,null,0,10,97,98,null,0,25,65,96,null,0,0,0,0,null,0,0,0,0,null,0,0,53,57,null,0,5,44,36]
["Lavalleja",1577,0,0,0,0,null,0,0,0,0,null,0,175,206,180,null,0,0,0,0,null,0,90,123,114,null,0,0,0,0,null,0,12,10,9,null,0,40,116,119,null,0,3,20,16,null,0,0,14,28,null,0,6,65,59,null,0,0,47,55,null,0,0,0,0,null,0,0,0,0,null,0,0,0,0,null,0,5,28,37]
["Maldonado",4366,0,0,0,0,null,0,0,0,0,null,0,526,610,485,null,0,0,0,0,null,0,0,0,0,null,0,0,223,274,null,0,0,0,0,null,0,50,425,446,null,1,2,48,53,null,0,0,71,64,null,0,3,216,240,null,0,0,260,253,null,0,0,0,0,null,0,0,0,0,null,0,0,31,30,null,0,1,25,29]
["Paysandú",3434,0,0,0,0,null,0,0,0,0,null,0,126,195,186,null,0,0,0,0,null,0,105,98,91,null,0,106,263,241,null,0,34,131,137,null,0,79,298,285,null,0,23,78,70,null,0,0,89,89,null,0,44,188,157,null,0,24,71,56,null,0,0,3,1,null,0,0,47,35,null,0,0,0,0,null,0,14,34,36]
["Río Negro",1866,0,0,0,0,null,0,0,0,0,null,0,117,171,101,null,0,0,0,0,null,0,138,207,193,null,0,0,23,25,null,0,0,0,0,null,0,21,176,193,null,0,3,46,40,null,0,0,33,42,null,0,13,75,84,null,0,0,25,50,null,0,0,3,3,null,0,0,22,27,null,0,0,0,0,null,0,1,15,19]
["Rivera",3429,0,0,0,0,null,0,0,0,0,null,0,229,248,198,null,0,0,0,0,null,0,128,188,193,null,0,0,435,442,null,0,0,105,87,null,0,0,75,178,null,0,27,61,85,null,0,0,90,98,null,0,0,131,166,null,0,0,59,77,null,0,0,0,0,null,0,0,0,0,null,0,0,23,29,null,0,6,35,36]
["Rocha",2225,0,0,0,0,null,0,0,0,0,null,0,195,324,188,null,0,0,0,0,null,0,40,125,66,null,0,0,118,130,null,0,0,0,0,null,0,3,180,303,null,0,6,17,22,null,0,0,25,53,null,0,0,160,183,null,0,0,0,0,null,0,0,0,0,null,0,0,0,28,null,0,0,0,0,null,0,12,28,19]
["Salto",4488,0,0,0,0,null,0,17,59,64,null,0,311,316,183,null,0,0,0,0,null,0,118,127,105,null,0,86,477,459,null,0,0,0,0,null,0,36,108,187,null,0,68,120,141,null,0,0,0,60,null,0,0,411,374,null,0,26,240,253,null,0,0,0,0,null,0,0,0,0,null,0,26,23,34,null,0,8,23,28]
["San José",3566,0,0,0,0,null,0,57,112,90,null,0,248,201,191,null,0,0,0,0,null,0,158,123,115,null,0,34,345,371,null,0,0,0,0,null,0,41,263,266,null,0,17,103,124,null,0,24,23,21,null,0,0,151,177,null,0,21,25,28,null,0,0,0,0,null,0,0,24,17,null,0,33,54,26,null,0,0,46,37]
["Soriano",2439,0,0,0,0,null,0,0,0,0,null,0,293,254,192,null,0,0,0,0,null,0,21,30,23,null,0,0,165,159,null,0,0,0,0,null,0,33,228,258,null,0,4,30,26,null,0,0,56,80,null,0,0,128,144,null,0,0,102,127,null,0,0,0,0,null,0,0,0,0,null,0,0,0,0,null,0,7,43,36]
["Tacuarembó",2828,0,0,0,0,null,0,0,0,0,null,0,330,382,202,null,0,0,0,0,null,0,75,99,59,null,0,5,170,220,null,0,0,0,0,null,0,9,148,257,null,0,31,86,111,null,0,0,50,66,null,0,18,104,120,null,0,0,23,52,null,0,0,0,0,null,0,0,0,0,null,0,0,61,56,null,0,15,31,48]
["Treinta y Tres",1611,0,0,0,0,null,0,0,0,0,null,0,132,152,133,null,0,0,0,0,null,0,98,137,129,null,0,30,57,65,null,0,0,0,0,null,0,10,127,119,null,0,13,20,15,null,0,0,47,57,null,0,8,48,57,null,0,0,25,36,null,0,0,0,0,null,0,0,0,0,null,0,0,23,19,null,0,12,21,21]
["Fuente: Procesamiento propio en base a datos proporcionados por el D.E.E. — C.E.I.P."]

{"sheet":"II-1.2.3","index":7,"n_rows":33,"n_cols":14,"rows_kept":33,"cut":false,"hidden":false,"merged":[[0,11,1,13],[4,0,4,13],[5,0,9,0],[5,3,5,13],[6,3,6,7],[6,9,6,13],[7,1,9,1],[7,3,7,7],[7,9,7,13],[8,2,9,2],[8,13,9,13],[8,3,9,3],[8,4,9,4],[8,5,9,5],[8,6,9,6],[8,7,9,7],[8,12,9,12],[8,8,9,8],[8,9,9,9],[8,10,9,10],[8,11,9,11]]}
["CONSEJO DE EDUCACIÓN INICIAL Y PRIMARIA",null,null,null,null,null,null,null,null,null,null,"ESTUDIANTES MATRICULADOS"]
[]
["Cuadro Nº II-1.2.3"]
[]
["ESTUDIANTES MATRICULADOS EN EDUCACIÓN EN LA PRIMERA INFANCIA E INICIAL PRIVADA POR MODALIDAD Y NIVEL SEGÚN DEPARTAMENTO (Todo el país, 2017)"]
["DEPARTAMENTO",null,null,"MODALIDAD"]
[null,null,null,"JARDINES PRIVADOS",null,null,null,null,null,"INICIAL EN COLEGIOS"]
[null,"TOTAL",null,"NIVEL",null,null,null,null,null,"NIVEL"]
[null,null,"Total","Nursery","2 años","3 años","4 años","5 años","Total","Nursery","2 años","3 años","4 años","5 años"]
[]
["TOTAL",{"$f":"+B12+B13","v":28748},{"$f":"+C12+C13","v":4054},{"$f":"SUM(D12:D13)","v":784},1028,953,728,561,{"$f":"+I12+I13","v":24694},{"$f":"SUM(J12:J13)","v":1499},{"$f":"SUM(K12:K13)","v":3625},{"$f":"SUM(L12:L13)","v":5097},{"$f":"SUM(M12:M13)","v":6827.9999999999991},{"$f":"SUM(N12:N13)","v":7645.0000000000018}]
["MONTEVIDEO",{"$f":"+C12+I12","v":17734},{"$f":"SUM(D12:H12)","v":2973},585,728.99999999999989,688,536,434.99999999999994,{"$f":"SUM(J12:N12)","v":14761.000000000002},871.00000000000011,2058,2911.0000000000005,4141.9999999999991,4779.0000000000018]
["RESTO DEL PAÍS",{"$f":"SUM(B15:B32)","v":11014},{"$f":"SUM(C15:C32)","v":1081},199,299,265,192,126,9933,627.99999999999989,1567,2186,2686,2866]
[]
["Artigas",{"$f":"+C15+I15","v":217},{"$f":"SUM(D15:H15)","v":0},0,0,0,0,0,{"$f":"+J15+K15+L15+M15+N15","v":217},38,48,38,44,49]
["Canelones",3538,218,21,82,38,47,30,3320,200.99999999999991,490,757.99999999999989,876.99999999999989,994.00000000000023]
["Cerro Largo",239,0,0,0,0,0,0,239,0,25,28,88,98.000000000000014]
["Colonia",600,0,0,0,0,0,0,600,60,84,154,167,135]
["Durazno",239,0,0,0,0,0,0,239,11,35,51,74,68]
["Flores",97,0,0,0,0,0,0,97,0,27,25,18,27]
["Florida",162,31,19,6,6,0,0,131,2,20,29,39,41]
["Lavalleja",324,0,0,0,0,0,0,324,37,61.999999999999993,78,66,81]
["Maldonado",1649,114,7,20,29,32,26,1535,51,241,355.99999999999994,422.00000000000006,465.00000000000006]
["Paysandú",483,122,19,22,37,24,20,361,12,18.999999999999996,37.999999999999993,148,144]
["Río Negro",284,0,0,0,0,0,0,284,25,45,43,94,77]
["Rivera",280,0,0,0,0,0,0,280,10,37.999999999999993,76,75.999999999999986,80]
["Rocha",283,0,0,0,0,0,0,283,23,60,58,71,71]
["Salto",1021,355,91,110,90,52,12,666,54,121,130,167,194]
["San José",551,115,23,24,37,14,17,436,33,48,115.00000000000001,120,120]
["Soriano",250,0,0,0,0,0,0,250,0,63,60,55,72]
["Tacuarembó",669,126,19,35,28,23,21,543,71.000000000000014,126,114.99999999999999,124,107]
["Treinta y Tres",128,0,0,0,0,0,0,128,0,15,34,36,43]
["Fuente: Procesamiento propio en base a datos proporcionados por el D.E.E. — C.E.I.P."]

{"sheet":"II-1.2.4","index":8,"n_rows":40,"n_cols":9,"rows_kept":40,"cut":false,"hidden":false,"merged":[[39,0,39,7],[11,4,11,7],[0,8,2,9],[7,0,7,7],[8,0,12,0],[8,4,8,7],[9,1,10,3],[9,4,10,5],[9,6,10,7],[11,1,12,1],[11,2,11,3]]}
["MINISTERIO DE EDUCACIÓN Y CULTURA",null,null,null,null,null,null,null,"ESTUDIANTES MATRICULADOS"]
["Dirección de Educación – Área de Educación en la Primera Infancia"]
["INAU-CAIF"]
[]
[]
["Cuadro Nº II-1.2.4"]
[]
["ESTUDIANTES MATRICULADOS EN EDUCACIÓN EN LA PRIMERA INFANCIA E INICIAL  POR FORMA DE ADMINISTRACIÓN Y SEXO SEGÚN DEPARTAMENTO (Todo el país, 2017)"]
["  DEPARTAMENTO",null,null,null,"FORMA DE ADMINISTRACIÓN"]
[null,"TOTAL",null,null,"CAIF,CAPI Y NUESTROS NIÑOS",null,"Centros Privados"]
[]
[null,"TOTAL","SEXO",null,"SEXO"]
[null,null,"VARÓN","MUJER","V","M","V","M"]
["TOTAL",{"$f":"+B15+B16","v":72532},{"$f":"E14+G14","v":37097},{"$f":"F14+H14","v":35435},{"$f":"E15+E16","v":28380},{"$f":"F15+F16","v":27148},{"$f":"G15+G16","v":8717},{"$f":"H15+H16","v":8287}]
["MONTEVIDEO",{"$f":"+C15+D15","v":24345},12536,11809,{"$f":"6458+659","v":7117},{"$f":"6149+636","v":6785},5419,5024]
["RESTO DEL PAÍS",{"$f":"+C16+D16","v":48187},24561,23626,{"$f":"SUM(E17:E35)","v":21263},{"$f":"SUM(F17:F35)","v":20363},{"$f":"SUM(G17:G35)","v":3298},{"$f":"SUM(H17:H35)","v":3263}]
[]
["Artigas",{"$f":"+C18+D18","v":2534},{"$f":"E18+G18","v":1290},{"$f":"F18+H18","v":1244},1220,1169,70,75]
["Canelones",10963,5606,5357,4241,4043,1365.0000000000002,1314]
["Cerro Largo",2926,1511,1415,1486,1386,25,29]
["Colonia",2512,1291,1221,1006,958,285,263]
["Durazno",2247,1174,1073,1040,960,134,113]
["Flores",946,478,468,435,414,43,54]
["Florida",1691,859,832,717,678,142,154]
["Lavalleja",1139,574,565,495,493,79,72]
["Maldonado",2091,1021,1070,808,822,213,247.99999999999997]
["Paysandú",3735,1910,1825,1730,1644,180,181]
["Río Negro",1547,768,779,707,724,61,55]
["Rivera",2876,1424,1452,1241,1257,183,195]
["Rocha",2015,1021,994,954,941,67,53]
["Salto",3427,1750,1677,1669,1617,81,60]
["San José",1980,1025,955,892,813,133,142]
["Soriano",2017,1049,968,847,756,202,212]
["Tacuarembó",2297,1173,1124,1138,1081,35,43]
["Treinta y Tres",1244,637,607,637,607,0,0]
["Fuente: Procesamiento propio en base a datos proporcionados por:"]
["        Registro Nacional de Centros de Educación Infantil Privados. MEC"]
["        Para CAIF Y CENTROS DIURNOS: SIPI de INAU."]
["Nota: Privados supervisados por el MEC"]
["CAIF y Centros Diurnos incluyen para este año la matrícula de Experiencia Oportuna (0 a 1 año) que en el anuario 2012 solo se incluía en el cuadro II."]

{"sheet":"II-1.2.5","index":9,"n_rows":23,"n_cols":16,"rows_kept":23,"cut":false,"hidden":false,"merged":[[6,1,8,1],[6,0,8,0],[0,14,1,15],[0,16,1,17],[1,0,1,10],[4,0,4,14],[5,4,5,14],[6,2,8,3],[8,4,8,15],[6,4,7,5],[6,6,7,7],[6,8,7,9],[6,10,7,11],[6,12,7,13],[6,14,7,15],[22,0,22,15],[24,0,24,15],[25,0,25,14],[26,0,26,14],[27,0,27,14]]}
["MINISTERIO DE EDUCACIÓN Y CULTURA",null,null,null,null,null,null,null,null,null,null,null,null,null,"ESTUDIANTES MATRICULADOS"]
["Dirección de Educación – Área de Educación en la Primera Infancia"]
[]
["Cuadro Nº II-1.2.5"]
["ESTUDIANTES MATRICULADOS EN EDUCACIÓN EN LA PRIMERA INFANCIA E INICIAL  POR FORMA DE ADMINISTRACIÓN SEGÚN EDAD (Todo el país, 2017)"]
[null,null,null,null,"FORMA DE ADMINISTRACIÓN"]
["EDAD","TOTAL","SEXO",null,"CEIP- PÚBLICOS",null,"CEIP-PRIVADOS (Habilitados y Autorizados) ",null,"CAIF",null,"CAPI",null,"NUESTROS NIÑOS",null,"PRIVADOS MEC"]
[]
[null,null,null,null,"SEXO"]
[null,null,"V","M","V","M","V","M","V","M","V","M","V","M","V","M"]
[]
["TOTAL",{"$f":"SUM(B13:B19)","v":187852},{"$f":"E12+G12+I12+K12+M12+O12","v":95870},{"$f":"F12+H12+J12+L12+N12+P12","v":91982},{"$f":"SUM(E13:E19)","v":44176},{"$f":"SUM(F13:F19)","v":42396},14597,14151,{"$f":"SUM(I13:I19)","v":26876},25676,845,836,659,636,{"$f":"SUM(O13:O19)","v":8717},{"$f":"SUM(P13:P19)","v":8287}]
["0 a 11 meses",{"$f":"C13+D13","v":10598},{"$f":"E13+G13+I13+K13+M13+O13","v":5473},{"$f":"F13+H13+J13+L13+N13+P13","v":5125},9,6,1186,1097,3778,3521,49,53,5,3,446,445]
["1 año",{"$f":"C14+D14","v":19130},9867,9263,23,21,0,0,7675,7225,269,281,62,66,1838,1670]
["2 años",25544,12983,12561,28,19,2371,2282,7612,7377,342,323,237,220,2393,2340]
["3 años",37848,19170,18678,6730,6714,3062,2988,6691,6431,159,150,289,271,2239,2124]
["4 años",48696,24863,23833,18646,17742,3830,3726,1120,1122,26,29,66,76,1175,1138]
["5 años",{"$f":"C18+D18","v":45882},{"$f":"E18+G18+I18+K18+M18+O18","v":23437},{"$f":"F18+H18+J18+L18+N18+P18","v":22445},18719,17873,4148,4058,0,0,0,0,0,0,570,514]
["6 años",154,77,77,21,21,0,0,0,0,0,0,0,0,56,56]
["Fuente: Procesamiento propio en base a datos proporcionados por:"]
["Registro Nacional de Centros de Educación Infantil Privados. MEC; SIPI de INAU; Departamento de Estadística del CEIP."]
["La denomicación de Centros Diurnos pasó a ser CAPI (Centros de Atención a la Primera Infancia)"]
["Para CAIF las edades de 0 y 1 año corresponden a la modalidad Experiencia Oportuna."]

{"sheet":"II-1.2.6","index":10,"n_rows":33,"n_cols":6,"rows_kept":33,"cut":false,"hidden":false,"merged":[[0,5,1,6],[4,0,4,5],[5,2,5,5],[5,0,8,0],[5,1,8,1],[7,2,7,5],[6,2,6,3],[6,4,6,5]]}
["CONSEJO DE EDUCACIÓN INICIAL Y PRIMARIA",null,null,null,null,"ESTUDIANTES MATRICULADOS"]
[]
["Cuadro Nº II-1.2.6"]
[]
["ESTUDIANTES MATRICULADOS EN EDUCACIÓN EN LA PRIMERA INFANCIA E INICIAL PÚBLICA DEL CEIP POR ÁREA DEMOGRÁFICA SEGÚN DEPARTAMENTO (Todo el país, 2017)"]
["DEPARTAMENTO","TOTAL","NIVEL"]
[null,null,"Educación Inicial",null,"Inicial en Escuelas"]
[null,null,"ÁREA DEMOGRÁFICA"]
[null,null,"RURAL","URBANA","RURAL","URBANA"]
["TOTAL ",{"$f":"SUM(C10:F10)","v":86572},{"$f":"SUM(C11:C12)","v":0},{"$f":"SUM(D11:D12)","v":37932},3999,44641]
["MONTEVIDEO",{"$f":"SUM(C11:F11)","v":26578},0,14365,0,12213]
["RESTO DEL PAÍS",59994,{"$f":"SUM(C14:C31)","v":0},{"$f":"SUM(D14:D31)","v":23567},3999,32428]
[]
["Artigas",{"$f":"SUM(C14:F14)","v":2507},0,789,196,1522]
["Canelones",14466,0,7333,597,6536]
["Cerro Largo",2787,0,1102,218,1467]
["Colonia",3865,0,1030,295,2540]
["Durazno",1752,0,665,92,995]
["Flores",775,0,259,76,440]
["Florida",2013,0,694,235,1084]
["Lavalleja",1577,0,888,103,586]
["Maldonado",4366,0,1621,159,2586]
["Paysandú",3434,0,801,259,2374]
["Río Negro",1866,0,927,130,809]
["Rivera",3429,0,1184,250,1995]
["Rocha",2225,0,938,104,1183]
["Salto",4488,0,1300,388,2800]
["San José",3566,0,1295,327,1944]
["Soriano",2439,0,813,146,1480]
["Tacuarembó",2828,0,1147,322,1359]
["Treinta y Tres",1611,0,781,102,728]
["Fuente: Procesamiento propio en base a datos proporcionados "]
["        por el D.E.E. — C.E.I.P."]

{"sheet":"II-1.2.7","index":11,"n_rows":33,"n_cols":10,"rows_kept":33,"cut":false,"hidden":false,"merged":[[10,9,11,11],[33,0,33,7],[36,0,36,7],[0,9,1,10],[5,0,5,7],[6,0,8,0],[7,1,8,1],[7,2,8,2],[7,3,8,3],[7,4,8,4],[7,5,8,5],[7,6,8,6],[7,8,8,8],[6,2,6,8],[7,7,8,7]]}
["MINISTERIO DE EDUCACIÓN Y CULTURA",null,null,null,null,null,null,null,null,"ESTUDIANTES MATRICULADOS"]
["Dirección de Educación – Área de Educación en la Primera Infancia"]
[]
["Cuadro Nº II-1.2.7"]
[]
["ESTUDIANTES MATRICULADOS EN EDUCACIÓN EN LA PRIMERA INFANCIA E INICIAL  EN CENTROS PRIVADOS HABILITADOS POR EL MEC, POR EDAD SEGÚN DEPARTAMENTO (Todo el país, 2017)"]
["DEPARTAMENTO",null,"E D A D"]
[null,"TOTAL","0 a 11 meses","1 año","2 años","3 años","4 años","5 años","6 años"]
[]
["TOTAL",{"$f":"+B11+B12","v":17004},{"$f":"+C11+C12","v":891},{"$f":"+D11+D12","v":3508.0000000000014},4732.9999999999991,4363,2313,1084,112.00000000000001]
["MONTEVIDEO",{"$f":"+C11+D11+E11+F11+G11+H11+I11","v":10443},685,2195.0000000000014,2872.9999999999991,2640.9999999999995,1374.0000000000002,616,59.000000000000014]
["RESTO DEL PAÍS",{"$f":"SUM(B14:B31)","v":6561},{"$f":"SUM(C14:C31)","v":206},{"$f":"SUM(D14:D31)","v":1313},1860,1722,939,468,53]
[]
["Artigas",{"$f":"+C14+D14+E14+F14+G14+H14+I14","v":145},3,24,35,37,39,2,5]
["Canelones",{"$f":"+C15+D15+E15+F15+G15+H15+I15","v":2679},97.000000000000014,507,698.99999999999989,695,431.99999999999994,241,8]
["Cerro Largo",54,6,22,15,6,5,0,0]
["Colonia",548,21,136.99999999999997,207,174,9,0,0]
["Durazno",247,0,43,67,51,39,47,0]
["Flores",97,0,15,26,15,18,15,8]
["Florida",296,6,74,65,70,62,13.000000000000002,6]
["Lavalleja",151,13,39,62,35,2,0,0]
["Maldonado",461,12,69,133,139,75,33,0]
["Paysandú",361,23,92,104.00000000000001,66,55,21,0]
["Río Negro",116,0,40,32,39,3,2,0]
["Rivera",378,2,67,92,110,70,37,0]
["Rocha",120,0,16,29,23,13,14,25]
["Salto",141,0,37,40,40,19,5,0]
["San José",275,10,43,99,84,24,14,1.0000000000000002]
["Soriano",414,13,76,132,113,59.000000000000007,21,0]
["Tacuarembó",78,0,12,23,25,15,3,0]
["Treinta y Tres",0,0,0,0,0,0,0,0]
["Fuente: Procesamiento propio en base a datos proporcionados por:"]
["        Registro Nacional de Centros de Educación Infantil Privados. MEC"]

{"sheet":"II-1.3.1","index":12,"n_rows":33,"n_cols":4,"rows_kept":33,"cut":false,"hidden":false,"merged":[[0,3,1,4],[4,0,4,1],[5,0,6,0],[5,1,6,1],[30,0,30,4]]}
["CONSEJO DE EDUCACIÓN INICIAL Y PRIMARIA",null,null,"PERSONAL DOCENTE"]
[]
["Cuadro Nº II-1.3.1"]
[]
["PERSONAL DOCENTE DE EDUCACIÓN EN LA PRIMERA INFANCIA E INICIAL  PÚBLICA DEL CEIP SEGÚN DEPARTAMENTO (Todo el país, 2017)"]
["DEPARTAMENTO","DOCENTES"]
[]
["TOTAL",{"$f":"SUM(B9:B10)","v":3019}]
["MONTEVIDEO",1012]
["RESTO DEL PAÍS",{"$f":"SUM(B12:B29)","v":2007}]
[]
["Artigas",83]
["Canelones",486]
["Cerro Largo",89]
["Colonia",109]
["Durazno",55]
["Flores",27]
["Florida",73]
["Lavalleja",61]
["Maldonado",164]
["Paysandú",100]
["Río Negro",71]
["Rivera",113]
["Rocha",81]
["Salto",133]
["San José",118]
["Soriano",85]
["Tacuarembó",99]
["Treinta y Tres",60]
["Fuente: D.E.E. - C.E.I.P"]
["Nota: Personal docente solo considera maestro/a de clase. "]
["        "]
["        "]

{"sheet":"II-1.3.2","index":13,"n_rows":34,"n_cols":5,"rows_kept":34,"cut":false,"hidden":false,"merged":[[34,0,36,4],[32,0,32,4],[0,4,1,5],[4,0,4,4],[5,0,8,0],[5,2,6,3],[7,1,8,1],[7,2,8,2],[7,3,8,3],[7,4,8,4]]}
["CONSEJO DE EDUCACIÓN INICIAL Y PRIMARIA",null,null,null,"PERSONAL DOCENTE"]
[]
["Cuadro Nº II-1.3.2."]
[]
["PERSONAL DOCENTE DE EDUCACIÓN EN LA PRIMERA INFANCIA E INICIAL PRIVADA SEGÚN DEPARTAMENTO (Todo el país, 2017)"]
["DEPARTAMENTO",null,"DOCENTES"]
[]
[null,"TOTAL","Colegios Habilitados","Colegios Autorizados","Jardines de Infantes Autorizados"]
[]
["TOTAL",{"$f":"SUM(B11:B12)","v":1959},{"$f":"SUM(C11:C12)","v":1577},{"$f":"SUM(D11:D12)","v":74},{"$f":"SUM(E11:E12)","v":308}]
["MONTEVIDEO",{"$f":"+C11+D11+E11","v":1184},895,65,224]
["RESTO DEL PAÍS",{"$f":"+C12+D12+E12","v":775},{"$f":"SUM(C14:C31)","v":682},{"$f":"SUM(D14:D31)","v":9},{"$f":"SUM(E14:E31)","v":84}]
[]
["Artigas",{"$f":"+C14+D14+E14","v":29},29,0,0]
["Canelones",{"$f":"+C15+D15+E15","v":239},205,7,27]
["Cerro Largo",13,13,0,0]
["Colonia",41,41,0,0]
["Durazno",11,11,0,0]
["Flores",8,8,0,0]
["Florida",13,10,0,3]
["Lavalleja",19,19,0,0]
["Maldonado",129,120,0,9]
["Paysandú",34,28,0,6]
["Río Negro",24,22,2,0]
["Rivera",25,25,0,0]
["Rocha",17,17,0,0]
["Salto",63,39,0,24]
["San José",27,23,0,4]
["Soriano",25,24,0,1]
["Tacuarembó",51,41,0,10]
["Treinta y Tres",7,7,0,0]
["Fuente: D.E.E. — C.E.P.","C.E.I.P"]
["Nota: Personal docente solo considera maestro/a de clase. "]
["Centros privados habilitados o autorizados por ANEP."]

{"sheet":"II-1.3.3 ","index":14,"n_rows":37,"n_cols":7,"rows_kept":37,"cut":false,"hidden":false,"merged":[[0,4,1,5],[4,0,5,6],[6,2,6,3],[7,0,8,0],[7,1,8,1],[7,2,8,2],[7,3,8,3],[7,4,8,4],[7,5,8,5],[7,6,8,6]]}
["CONSEJO DE EDUCACIÓN INICIAL Y PRIMARIA",null,null,null,"PERSONAL DOCENTE"]
[]
["Cuadro Nº II-1.3.3."]
[]
["PERSONAL DOCENTE EN EDUCACIÓN EN LA PRIMERA INFANCIA PRIVADA SUPERVISADA POR EL MEC SEGÚN FUNCIÓN Y DEPARTAMENTO (Todo el país, 2017)"]
[]
[null,null,"FUNCIÓN"]
["DEPARTAMENTO","TOTAL","Director responsable técnico","Educadores","Otros especialistas","Profesores especiales","Responsable legal"]
[]
["TOTAL",{"$f":"SUM(C10:G10)","v":3758},{"$f":"C12+C11","v":334},{"$f":"D11+D12","v":2430},236,409,{"$f":"G11+G12","v":349}]
["MONTEVIDEO",{"$f":"SUM(C11:G11)","v":2421},202,1567,172,273,207]
["RESTO DEL PAIS",{"$f":"SUM(C12:G12)","v":1337},{"$f":"SUM(C14:C31)","v":132},{"$f":"SUM(D14:D31)","v":863},{"$f":"SUM(E14:E31)","v":64},{"$f":"SUM(F14:F31)","v":136},{"$f":"SUM(G14:G31)","v":142}]
[]
["Artigas",{"$f":"SUM(C14:G14)","v":29},3,22,1,0,3]
["Canelones ",{"$f":"SUM(C15:G15)","v":528},56,342,23,49,58]
["Cerro Largo",13,1,8,3,0,1]
["Colonia",105,14,66,3,8,14]
["Durazno",46,3,32,2,7,2]
["Flores",14,1,10,1,1,1]
["Florida",62,4,40,5,8,5]
["Lavalleja",44,5,27,4,3,5]
["Maldonado",115,8,67,9,20,11]
["Paysandú",66,6,46,2,6,6]
["Rio Negro",62,2,46,2,6,6]
["Rivera",72,5,49,1,12,5]
["Rocha",19,3,10,1,2,3]
["Salto ",25,3,18,0,1,3]
["San José",46,7,25,2,4,8]
["Soriano",70,8,44,3,7,8]
["Tacuarembó",21,3,11,2,2,3]
["Treinta y Tres",0,0,0,0,0,0]
["Fuente: Procesamiento propio en base a datos proporcionados por Registro Nacional de Centros de Educación Infantil Privados - MEC."]
["Nota:"]
["Director responsable técnico: art 4. 268/014"]
["Educadores: Son aquellos que la tarea de docencia es directa, ya sea de carácter de docente propiamente dicho o de auxiliar. Informe Primer censo nacional de centros de Educaciòn Infanti Privados."]
["Otros especialistas: Se refiere a profesionales que apoyan la tarea de los educadores sin ejercer educación directa. En esta categoría entran psicólogo, psicomotricistas, trabajadores sociales, nutricionistas, médico pediatra y otros especialistas."]
["Profesores especiales: Son docentes que se especializan en un área en particular. Esta categoría incluye profesores de computación, inglés, plástica, eduación musical u artística. "]

{"sheet":" PRIMARIA ","index":15,"n_rows":200,"n_cols":2,"rows_kept":200,"cut":false,"hidden":false,"merged":[]}
[]
[]
[]
[]
[]
[]
["Cuadro Nº II-2.1.1  "," ESTABLECIMIENTOS DE EDUCACIÓN PRIMARIA POR FORMA DE ADMINISTRACIÓN Y TIPO DE EDUCACIÓN SEGÚN DEPARTAMENTO. (Todo el país, 2017). "]
[""]
["Cuadro Nº II-2.1.2  ","ESTABLECIMIENTOS DE EDUCACIÓN PRIMARIA PÚBLICA COMÚN POR ÁREA DEMOGRÁFICA Y CATEGORÍA SEGÚN DEPARTAMENTO.  (Todo el país, 2017). "]
[""]
["Cuadro Nº II-2.1.3  ","ESTABLECIMIENTOS DE EDUCACIÓN PRIMARIA PÚBLICA ESPECIAL POR TIPO DE DISCAPACIDAD SEGÚN DEPARTAMENTO.  (Todo el país, 2017)."]
[""]
["Cuadro Nº II-2.1.4  ","ESTABLECIMIENTOS DE EDUCACIÓN PRIMARIA PRIVADA POR TIPO DE EDUCACIÓN SEGÚN DEPARTAMENTO. (Todo el país, 2017)."]
[""]
[""]
["Cuadro Nº II-2.2.1  ","ESTUDIANTES MATRICULADOS EN EDUCACIÓN PRIMARIA COMÚN POR FORMA DE ADMINISTRACIÓN Y SEXO SEGÚN DEPARTAMENTO.  (Todo el país, 2017). "]
[""]
["Cuadro Nº II-2.2.2  ","ESTUDIANTES MATRICULADOS EN EDUCACIÓN PRIMARIA PÚBLICA POR TIPO DE EDUCACIÓN Y SEXO SEGÚN DEPARTAMENTO. (Todo el país, 2017). "]
[""]
["Cuadro Nº II-2.2.3  "," ESTUDIANTES MATRICULADOS EN EDUCACIÓN PRIMARIA PÚBLICA COMÚN POR ÁREA DEMOGRÁFICA Y CATEGORÍA SEGÚN DEPARTAMENTO.  (Todo el país, 2017). "]
[""]
["Cuadro Nº II-2.2.4  "," ESTUDIANTES MATRICULADOS EN EDUCACIÓN PRIMARIA PÚBLICA ESPECIAL POR TIPO DE DISCAPACIDAD SEGÚN DEPARTAMENTO.  (Todo el país, 2017). "]
[""]
["Cuadro Nº II-2.2.5  "," ESTUDIANTES MATRICULADOS EN EDUCACIÓN ESPECIAL PÚBLICA POR EDADES SIMPLES Y SEXO SEGÚN DEPARTAMENTO.  (Todo el país, 2017). "]
[""]
["Cuadro Nº II-2.2.6  "," ESTUDIANTES MATRICULADOS EN EDUCACIÓN PRIMARIA PRIVADA POR TIPO DE EDUCACIÓN SEGÚN DEPARTAMENTO. (Todo el país, 2017). "]
[""]
["Cuadro Nº II-2.2.7  "," ESTUDIANTES MATRICULADOS EN EDUCACIÓN ESPECIAL PRIVADA POR EDADES SIMPLES Y SEXO SEGÚN DEPARTAMENTO.  (Todo el país, 2017). "]
[""]
["Cuadro Nº II-2.2.8  "," ESTUDIANTES MATRICULADOS EN EDUCACIÓN PRIMARIA COMÚN POR GRADO Y FORMA DE ADMINISTRACIÓN SEGÚN EDAD.  (Todo el país, 2017). "]
[""]
["Cuadro Nº II-2.2.9  ","ESTUDIANTES MATRICULADOS EN EDUCACIÓN PRIMARIA COMÚN PÚBLICA POR GRADO Y SEXO SEGÚN EDAD.  (Todo el país, 2017). "]
[""]
["Cuadro Nº II-2.2.10 ","ESTUDIANTES MATRICULADOS EN EDUCACIÓN PRIMARIA COMÚN PRIVADA POR GRADO Y SEXO SEGÚN EDAD.  (Todo el país, 2017) "]
[""]
["Cuadro Nº II-2.2.11 "," ESTUDIANTES MATRICULADOS EN EDUCACIÓN PRIMARIA COMÚN POR GRADO Y FORMA DE ADMINISTRACIÓN SEGÚN DEPARTAMENTO.  (Todo el país, 2017). "]
[""]
["Cuadro Nº II-2.2.12 ","RENDIMIENTO ESCOLAR EN EDUCACIÓN PRIMARIA COMÚN PÚBLICA POR ÁREA DEMOGRÁFICA SEGÚN GRADO.  (Todo el país, 2017). "]
[""]
["Cuadro Nº II-2.2.13 ","RENDIMIENTO ESCOLAR EN EDUCACIÓN PRIMARIA COMÚN PÚBLICA POR  ÁREA DEMOGRÁFICA SEGÚN DEPARTAMENTO.  (Todo el país, 2017). "]
[""]
["Cuadro Nº II-2.2.14 ","RENDIMIENTO ESCOLAR  EN EDUCACIÓN PRIMARIA COMÚN PÚBLICA POR SEXO SEGÚN DEPARTAMENTO.  (Todo el país, 2017)."]
[""]
["Cuadro Nº II-2.2.15 ","RENDIMIENTO ESCOLAR EN EDUCACIÓN PRIMARIA COMÚN PRIVADA POR SEXO SEGÚN DEPARTAMENTO. (Todo el país, 2017). "]
[""]
["Cuadro Nº II-2.2.16 ","ESTUDIANTES MATRICULADOS EGRESADOS DE EDUCACIÓN PRIMARIA COMÚN PÚBLICA POR ÁREA DEMOGRÁFICA SEGÚN DEPARTAMENTO (Todo el país, 2017)"]
[""]
["Cuadro Nº II-2.2.17 ","ESTUDIANTES MATRICULADOS EGRESADOS DE EDUCACIÓN PRIMARIA COMÚN POR FORMA DE ADMINISTRACIÓN SEGÚN DEPARTAMENTO (Todo el país, 2017)"]
[""]
["Cuadro Nº II-2.2.18 ","ASISTENCIA INSUFICIENTE Y ABANDONO INTERMITENTE DE 1º GRADO Y 1º A 6º GRADO EN EDUCACIÓN COMÚN PÚBLICA SEGÚN DEPARTAMENTO.  (Todo el país, 2017). "]
[""]
[""]
["Cuadro Nº II-2.3.1  ","PERSONAL DOCENTE DE EDUCACIÓN PRIMARIA PÚBLICA POR TIPO DE DESEMPEÑO DOCENTE SEGÚN DEPARTAMENTO.  (Todo el país, 2017). "]
[""]
["Cuadro Nº II-2.3.2  ","PERSONAL DOCENTE DE EDUCACIÓN PRIMARIA PRIVADA POR TIPO DE ESTABLECIMIENTO Y TIPO DE DESEMPEÑO DOCENTE SEGÚN DEPARTAMENTO.  (Todo el país, 2017). "]
[""]
[""]
[""]
[""]
[""]
[""]
[""]
[""]
[""]
[""]
[""]
[""]
[""]
[""]
[""]
[""]
[""]
[""]
[""]
[""]
[""]
[""]
[""]
[""]
[""]
[""]
[""]
[""]
[""]
[""]
[""]
[""]
[""]
[""]
[""]
[""]
[""]
[""]
[""]
[""]
[""]
[""]
[""]
[""]
[""]
[""]
[""]
[""]
[""]
[""]
[""]
[""]
[""]
[""]
[""]
[""]
[""]
[""]
[""]
[""]
[""]
[""]
[""]
[""]
[""]
[""]
[""]
[""]
[""]
[""]
[""]
[""]
[""]
[""]
[""]
[""]
[""]
[""]
[""]
[""]
[""]
[""]
[""]
[""]
[""]
[""]
[""]
[""]
[""]
[""]
[""]
[""]
[""]
[""]
[""]
[{"$f":"MID(B101, 1,20)","v":""}]
[""]
[""]
[""]
[""]
[""]
[""]
[""]
[""]
[""]
[""]
[""]
[""]
[""]
[""]
[""]
[""]
[""]
[""]
[""]
[""]
[""]
[""]
[""]
[""]
[""]
[""]
[""]
[""]
[""]
[""]
[""]
[""]
[""]
[""]
[{"$f":"MID(B136, 1,20)","v":""}]
[""]
[""]
[""]
[""]
[""]
[""]
[""]
[""]
[""]
[""]
[""]
[""]
[""]
[""]

{"sheet":"II-2.1.1","index":16,"n_rows":32,"n_cols":6,"rows_kept":32,"cut":false,"hidden":false,"merged":[[7,4,8,4],[7,5,8,5],[30,0,30,7],[0,4,1,6],[3,0,3,5],[4,0,8,0],[4,2,4,5],[5,1,8,1],[5,2,5,5],[6,2,6,3],[6,4,6,5],[7,2,8,2],[7,3,8,3]]}
["CONSEJO DE EDUCACIÓN PRIMARIA",null,null,null,"ESTABLECIMIENTOS"]
[]
["Cuadro Nº II-2.1.1"]
["ESTABLECIMIENTOS DE EDUCACIÓN PRIMARIA POR FORMA DE ADMINISTRACIÓN Y TIPO DE EDUCACIÓN SEGÚN DEPARTAMENTO (Todo el país, 2017)"]
["DEPARTAMENTO",null,"FORMA DE ADMINISTRACIÓN"]
[null,"TOTAL","TIPO DE EDUCACIÓN"]
[null,null,"PÚBLICA",null,"PRIVADA"]
[null,null,"Común","Especial","Común","Especial"]
[]
["TOTAL",{"$f":"+C10+D10+E10+F10","v":2505},{"$f":"SUM(C11:C12)","v":2004},{"$f":"SUM(D11:D12)","v":80},{"$f":"SUM(E11,E12)","v":352},{"$f":"SUM(F11:F12)","v":69}]
["MONTEVIDEO",{"$f":"+C11+D11+E11+F11","v":483},246,26,173,38]
["RESTO DEL PAÍS",2022,{"$f":"SUM(C13:C30)","v":1758},{"$f":"SUM(D13:D30)","v":54},{"$f":"SUM(E13:E30)","v":179},{"$f":"SUM(F13:F30)","v":31}]
["Artigas",82,76,2,2,2]
["Canelones",311,231,11,64,5]
["Cerro Largo",118,109,3,6,0]
["Colonia",139,123,4,10,2]
["Durazno",86,79,2,5,0]
["Flores",37,33,1,3,0]
["Florida",102,95,2,4,1]
["Lavalleja",92,84,2,6,0]
["Maldonado",111,79,4,25,3]
["Paysandú",120,103,2,10,5]
["Río Negro",68,58,2,7,1]
["Rivera",131,118,4,7,2]
["Rocha",78,69,3,4,2]
["Salto",112,98,3,7,4]
["San José",116,106,3,7,0]
["Soriano",108,97,3,4,4]
["Tacuarembó",139,130,2,7,0]
["Treinta y Tres",72,70,1,1,0]
["Fuente: Procesamiento propio en base a datos proporcionados por el D.E.E. — C.E.I.P."]
["Nota: Pública no incluye JICI"]

{"sheet":" II-2.1.2","index":17,"n_rows":32,"n_cols":18,"rows_kept":32,"cut":false,"hidden":false,"merged":[[8,4,9,4],[8,5,9,5],[8,6,9,6],[8,11,9,11],[8,16,9,16],[8,12,9,12],[8,15,9,15],[8,9,9,9],[8,13,9,13],[8,17,9,17],[0,15,1,17],[4,0,4,17],[5,0,9,0],[5,1,9,1],[5,2,5,17],[6,3,6,12],[6,15,6,17],[7,2,9,2],[7,3,7,12],[7,14,9,14],[7,15,7,17],[8,3,9,3],[8,10,9,10],[8,7,9,7],[8,8,9,8]]}
["CONSEJO DE EDUCACIÓN PRIMARIA",null,null,null,null,null,null,null,null,null,null,null,null,null,null,"ESTABLECIMIENTOS"]
[]
["Cuadro Nº II-2.1.2"]
[]
["ESTABLECIMIENTOS DE EDUCACIÓN PRIMARIA PÚBLICA COMÚN POR ÁREA DEMOGRÁFICA Y CATEGORÍA SEGÚN DEPARTAMENTO (Todo el país, 2017)"]
["DEPARTAMENTO","TOTAL","ÁREA DEMOGRÁFICA"]
[null,null,null,"URBANA",null,null,null,null,null,null,null,null,null,null,null,"RURAL"]
[null,null,"Total Urbana","CATEGORÍA",null,null,null,null,null,null,null,null,null,null,"Total Rural","CATEGORÍA"]
[null,null,null,"Aprender","Aprender H. de Práctica","Común ","Práctica","Tiempo Completo","Habilitada de Práctica","Tiempo Extendido H. de Práctica","Tiempo Extendido de Práctica","Tiempo Extendido","Unidocente","JICI",null,"Con Maestro a cargo","Internado Rural","Unidocente"]
[]
["TOTAL",{"$f":"+C11+O11","v":2005},{"$f":"SUM(D11:N11)","v":929},{"$f":"SUM(D12:D13)","v":241},{"$f":"SUM(E12:E13)","v":10},287,55,217,69,2,{"$f":"K12+K13","v":8},37,2,1,{"$f":"SUM(O12:O13)","v":1076},322,8,746]
["MONTEVIDEO",247,{"$f":"SUM(D12:N12)","v":247},93,0,70,14,51,7,1,4,6,0,1,0,0,0,0]
["RESTO DEL PAÍS",1758,{"$f":"SUM(D13:N13)","v":682},{"$f":"SUM(D14:D31)","v":148},10,217,41,166,62,1,{"$f":"SUM(K14:K31)","v":4},31,2,0,{"$f":"SUM(O14:O31)","v":1076},322,8,746]
["Artigas",76,{"$f":"SUM(D14:N14)","v":31},10,0,4,2,10,4,0,0,1,0,0,{"$f":"+P14+Q14+R14","v":45},17,1,27]
["Canelones",231,{"$f":"SUM(D15:N15)","v":137},39,2,42,7,30,11,0,0,6,0,0,{"$f":"+P15+Q15+R15","v":94},54,1,39]
["Cerro Largo",109,28,6,1,3,2,9,4,0,0,3,0,0,81,17,0,64]
["Colonia",123,42,3,0,22,3,7,4,0,1,2,0,0,81,21,0,60]
["Durazno",79,24,4,0,6,2,7,4,0,0,1,0,0,55,6,0,49]
["Flores",33,10,0,0,3,1,4,1,0,0,1,0,0,23,3,1,19]
["Florida",95,28,1,0,10,2,8,3,0,0,4,0,0,67,21,0,46]
["Lavalleja",84,24,0,1,10,2,6,2,0,0,1,2,0,60,10,0,50]
["Maldonado",79,43,7,0,13,2,13,7,0,0,1,0,0,36,11,1,24]
["Paysandú",103,46,10,4,17,2,10,2,0,1,0,0,0,57,18,2,37]
["Río Negro",58,21,1,0,10,1,6,2,0,1,0,0,0,37,13,1,23]
["Rivera",118,41,17,2,7,3,9,2,0,0,1,0,0,77,22,0,55]
["Rocha",69,32,6,0,14,2,9,0,1,0,0,0,0,37,4,0,33]
["Salto",98,40,12,0,6,3,12,5,0,0,2,0,0,58,28,1,29]
["San José",106,36,9,0,14,1,6,2,0,1,3,0,0,70,31,0,39]
["Soriano",97,35,6,0,16,2,8,3,0,0,0,0,0,62,11,0,51]
["Tacuarembó",130,42,13,0,13,2,7,3,0,0,4,0,0,88,27,0,61]
["Treinta y Tres",70,22,4,0,7,2,5,3,0,0,1,0,0,48,8,0,40]
["Fuente: Procesamiento propio en base a datos proporcionados por el DEE — CEIP",null,null,null,null,"D.E.E.-C.E.I.P."]

{"sheet":"II-2.1.3","index":18,"n_rows":35,"n_cols":5,"rows_kept":35,"cut":false,"hidden":false,"merged":[[30,0,30,4],[0,3,1,4],[4,0,4,4],[5,0,7,0],[5,1,7,1],[5,2,5,4],[6,2,7,2],[6,3,7,3],[6,4,7,4]]}
["CONSEJO DE EDUCACIÓN PRIMARIA",null,null,"Establecimientos"]
[]
["Cuadro Nº II-2.1.3"]
[]
["ESTABLECIMIENTOS DE EDUCACIÓN PRIMARIA PÚBLICA ESPECIAL POR TIPO DE DISCAPACIDAD SEGÚN DEPARTAMENTO (Todo el país, 2017)"]
["DEPARTAMENTO","TOTAL","DISCAPACIDAD"]
[null,null,"Intelectual","Auditiva","Visual"]
[]
["TOTAL",{"$f":"+B10+B11","v":80},{"$f":"SUM(C10:C11)","v":74},{"$f":"SUM(D10:D11)","v":4},{"$f":"SUM(E10:E11)","v":2}]
["MONTEVIDEO",{"$f":"+C10+D10+E10","v":26},23,1,2]
["RESTO DEL PAÍS",{"$f":"SUM(B12:B29)","v":54},{"$f":"SUM(C12:C29)","v":51},{"$f":"SUM(D12:D29)","v":3},{"$f":"SUM(E12:E29)","v":0}]
["Artigas",{"$f":"+C12+D12+E12","v":2},2,0,0]
["Canelones",11,11,0,0]
["Cerro Largo",3,3,0,0]
["Colonia",4,4,0,0]
["Durazno",2,2,0,0]
["Flores",1,1,0,0]
["Florida",2,2,0,0]
["Lavalleja",2,2,0,0]
["Maldonado",4,3,1,0]
["Paysandú",2,2,0,0]
["Río Negro",2,2,0,0]
["Rivera",4,3,1,0]
["Rocha",3,3,0,0]
["Salto",3,2,1,0]
["San José",3,3,0,0]
["Soriano",3,3,0,0]
["Tacuarembó",2,2,0,0]
["Treinta y Tres",1,1,0,0]
["Fuente: DEE — CEIP"]
["Nota: Los establecimientos que atienden discapacidades intelectuales, además de atender niños con disfunciones clásicamente tipificadas como “Intelectuales”, atienden a los niños con discapacidades de orden motriz o de carácter, lo que implica que la matrícula correspondiente los agrupa."]
["        "]
["        "]
["       "]
["        "]

{"sheet":"II-2.1.4","index":19,"n_rows":31,"n_cols":6,"rows_kept":31,"cut":false,"hidden":false,"merged":[[6,8,6,15],[7,3,8,3],[7,4,8,4],[7,8,7,15],[11,8,12,9],[11,10,12,10],[11,11,11,13],[0,4,1,5],[4,0,4,5],[5,0,8,0],[5,1,8,1],[5,3,5,5],[6,2,8,2],[6,3,6,4],[6,5,8,5]]}
["CONSEJO DE EDUCACIÓN PRIMARIA",null,null,null,"ESTABLECIMIENTOS"]
[]
["Cuadro Nº II-2.1.4"]
[]
["ESTABLECIMIENTOS DE EDUCACIÓN PRIMARIA PRIVADA POR TIPO DE EDUCACIÓN SEGÚN DEPARTAMENTO (Todo el país, 2017)"]
["DEPARTAMENTO","TOTAL",null,"TIPO DE EDUCACIÓN"]
[null,null,"Total","EDUCACIÓN COMÚN",null,"EDUCACIÓN ESPECIAL"]
[null,null,null,"Habilitados","Autorizados"]
[]
["TOTAL DEL PAÍS",{"$f":"+C10+F10","v":421},{"$f":"+D10+E10","v":352},{"$f":"SUM(D11:D12)","v":334},{"$f":"SUM(E11:E12)","v":18},{"$f":"SUM(F11:F12)","v":69}]
["MONTEVIDEO",{"$f":"+C11+F11","v":211},{"$f":"+D11+E11","v":173},163,10,38]
["RESTO DEL PAÍS",210,179,{"$f":"SUM(D13:D30)","v":171},{"$f":"SUM(E13:E30)","v":8},{"$f":"SUM(F13:F30)","v":31}]
["Artigas",4,2,2,0,2]
["Canelones",69,64,60,4,5]
["Cerro Largo",6,6,6,0,0]
["Colonia",12,10,10,0,2]
["Durazno",5,5,5,0,0]
["Flores",3,3,3,0,0]
["Florida",5,4,4,0,1]
["Lavalleja",6,6,6,0,0]
["Maldonado",28,25,25,0,3]
["Paysandú",15,10,9,1,5]
["Río Negro",8,7,5,2,1]
["Rivera",9,7,7,0,2]
["Rocha",6,4,4,0,2]
["Salto",11,7,7,0,4]
["San José",7,7,6,1,0]
["Soriano",8,4,4,0,4]
["Tacuarembó",7,7,7,0,0]
["Treinta y Tres",1,1,1,0,0]
["Fuente: Procesamiento propio en base a datos proporcionados por el D.E.E. — C.E.I.P."]

{"sheet":"II-2.2.1","index":20,"n_rows":31,"n_cols":10,"rows_kept":31,"cut":false,"hidden":false,"merged":[[6,7,7,7],[6,8,6,9],[30,0,30,9],[0,7,1,9],[3,0,3,9],[4,0,7,0],[4,1,7,1],[4,2,4,9],[5,2,6,3],[5,4,5,6],[5,7,5,9],[6,4,7,4],[6,5,6,6]]}
["CONSEJO DE EDUCACIÓN PRIMARIA",null,null,null,null,null,null,"ESTUDIANTES MATRICULADOS"]
[]
["Cuadro Nº II-2.2.1"]
["ESTUDIANTES MATRICULADOS EN EDUCACIÓN PRIMARIA COMÚN POR FORMA DE ADMINISTRACIÓN Y SEXO SEGÚN DEPARTAMENTO (Todo el país, 2017)"]
["DEPARTAMENTO","TOTAL","FORMA DE ADMINISTRACIÓN"]
[null,null,"TOTAL",null,"PÚBLICA",null,null,"PRIVADA"]
[null,null,null,null,"TOTAL","SEXO",null,"TOTAL","SEXO"]
[null,null,"VARÓN","MUJER",null,"V","M",null,"V","M"]
["TOTAL",{"$f":"E9+H9","v":295674},{"$f":"+F9+I9","v":151736},{"$f":"+G9+J9","v":143938},{"$f":"+F9+G9","v":243841},{"$f":"SUM(F10:F11)","v":125288},{"$f":"SUM(G10:G11)","v":118553},{"$f":"+I9+J9","v":51833},{"$f":"SUM(I10:I11)","v":26448.000000000004},{"$f":"SUM(J10:J11)","v":25384.999999999993}]
["MONTEVIDEO",{"$f":"E10+H10","v":108443},{"$f":"+F10+I10","v":55823},{"$f":"+G10+J10","v":52619.999999999993},{"$f":"+F10+G10","v":76483},39540,36943,{"$f":"+I10+J10","v":31959.999999999993},16283.000000000004,15676.999999999991]
["RESTO DEL PAÍS",187231,95913,91318,{"$f":"SUM(E12:E29)","v":167358},{"$f":"SUM(F12:F29)","v":85748},{"$f":"SUM(G12:G29)","v":81610},{"$f":"+I11+J11","v":19873},{"$f":"SUM(I12:I29)","v":10165},{"$f":"SUM(J12:J29)","v":9708}]
["Artigas",7420,3884,3536,{"$f":"+F12+G12","v":7235},3778,3457,{"$f":"+I12+J12","v":185},106,79]
["Canelones",49404,25330,24074,{"$f":"+F13+G13","v":41786},21416,20370,7617.9999999999991,3914,3703.9999999999991]
["Cerro Largo",8212,4260,3952,7597,3954,3643,615,306,309]
["Colonia",10859,5510,5349,10116,5134,4982,743,375.99999999999994,367]
["Durazno",5203,2675,2528,4653,2400,2253,550,275,275]
["Flores",2132,1050,1082,1880,929,951,252,121,131]
["Florida",5702,2950,2752,5454,2820,2634,248,130,118]
["Lavalleja",4686,2356,2330,4131,2079,2052,555,277,278]
["Maldonado",15791,7982,7809,12415,6230,6185,3376,1752,1624.0000000000002]
["Paysandú",11217,5711,5506,10089,5139,4950,1128,572,556.00000000000011]
["Río Negro",5722,2937,2785,5230,2660,2570,492,277,215.00000000000003]
["Rivera",10617,5453,5164,10050,5180,4870,567,273,294]
["Rocha",6596,3376,3220,6313,3232,3081,283,144,139]
["Salto",13298,6872,6426,12135,6278,5857,1163,593.99999999999989,569]
["San José",10173,5207,4966,9435,4851,4584,738,356,382]
["Soriano",7739,4011,3728,7284,3764,3520,455,247,208]
["Tacuarembó",8324,4202,4122,7611,3857,3754,713,345,368]
["Treinta y Tres",4136,2147,1989,3944,2047,1897,192,100,92]
["Fuente: Procesamiento propio en base a datos proporcionados por el DEE — CEIP."]
["Nota: Pública no incluye JICI."]

{"sheet":"II-2.2.2","index":21,"n_rows":32,"n_cols":12,"rows_kept":32,"cut":false,"hidden":false,"merged":[[9,141,9,142],[9,143,9,144],[9,145,9,146],[9,147,9,148],[32,0,32,9],[9,139,9,140],[34,0,34,9],[7,10,7,11],[8,4,9,4],[8,5,8,6],[8,8,8,9],[8,10,8,11],[0,7,1,9],[4,0,4,11],[5,0,9,0],[5,1,9,1],[5,2,8,3],[5,4,5,11],[6,4,7,6],[6,7,6,11],[7,7,9,7],[7,8,7,9]]}
["CONSEJO DE EDUCACIÓN PRIMARIA",null,null,null,null,null,null,"ESTUDIANTES MATRICULADOS"]
[]
["Cuadro Nº II-2.2.2"]
[]
["ESTUDIANTES MATRICULADOS EN EDUCACIÓN PRIMARIA PÚBLICA POR TIPO DE EDUCACIÓN Y SEXO SEGÚN DEPARTAMENTO (Todo el país, 2017)"]
["DEPARTAMENTO","TOTAL","TOTAL SEXO",null,"TIPO DE EDUCACIÓN "]
[null,null,null,null,"COMÚN ",null,null,"ESPECIAL "]
[null,null,null,null,null,null,null,"Total","ESCUELAS\nESPECIALES",null,"CLASES ESPECIALES EN ESCUELAS COMUNES"]
[null,null,null,null,"Total","SEXO",null,null,"SEXO",null,"SEXO"]
[null,null,"VARÓN","MUJER",null,"V","M",null,"V","M","V","M"]
["TOTAL",{"$f":"+C11+D11","v":250046},{"$f":"+F11+I11+K11","v":129160},{"$f":"+G11+J11+L11","v":120886},{"$f":"+F11+G11","v":243841},{"$f":"SUM(F12:F13)","v":125288},{"$f":"SUM(G12:G13)","v":118553},{"$f":"+I11+J11+K11+L11","v":6205},{"$f":"SUM(I12:I13)","v":3780},{"$f":"SUM(J12:J13)","v":2270},{"$f":"SUM(K12:K13)","v":92},{"$f":"SUM(L12:L13)","v":63}]
["MONTEVIDEO",{"$f":"+C12+D12","v":79041},{"$f":"+F12+I12+K12","v":41124},37917,{"$f":"+F12+G12","v":76483},39540,36943,{"$f":"+I12+J12+K12+L12","v":2558},1584,974,0,0]
["RESTO DEL PAÍS",171005,88036,82969,{"$f":"+F13+G13","v":167358},{"$f":"SUM(F14:F31)","v":85748},81610,3647,2196,1296,92,63]
["Artigas",7410,3891,3519,{"$f":"+F14+G14","v":7235},3778,3457,175,108,58,5,4]
["Canelones",42490,21859,20631,41786,21416,20370,704,409,245,34,16]
["Cerro Largo",7812,4085,3727,7597,3954,3643,215,125,81,6,3]
["Colonia",10320,5252,5068,10116,5134,4982,204,117,83,1,3]
["Durazno",4786,2490,2296,4653,2400,2253,133,88,39,2,4]
["Flores",1906,947,959,1880,929,951,26,18,7,0,1]
["Florida",5594,2908,2686,5454,2820,2634,140,83,50,5,2]
["Lavalleja",4272,2173,2099,4131,2079,2052,141,92,44,2,3]
["Maldonado",12722,6411,6311,12415,6230,6185,307,181,126,0,0]
["Paysandú",10266,5261,5005,10089,5139,4950,177,112,48,10,7]
["Río Negro",5383,2761,2622,5230,2660,2570,153,100,49,1,3]
["Rivera",10171,5245,4926,10050,5180,4870,121,65,56,0,0]
["Rocha",6541,3374,3167,6313,3232,3081,228,128,76,14,10]
["Salto",12437,6464,5973,12135,6278,5857,302,186,116,0,0]
["San José",9650,4996,4654,9435,4851,4584,215,139,69,6,1]
["Soriano",7459,3881,3578,7284,3764,3520,175,115,58,2,0]
["Tacuarembó",7788,3965,3823,7611,3857,3754,177,105,66,3,3]
["Treinta y Tres",3998,2073,1925,3944,2047,1897,54,25,25,1,3]
["Fuente: Procesamiento propio en base a datos proporcionados por el D.E.E. — C.E.I.P."]

{"sheet":"II-2.2.3","index":22,"n_rows":32,"n_cols":20,"rows_kept":32,"cut":false,"hidden":false,"merged":[[8,17,9,17],[0,14,1,17],[4,0,4,17],[5,0,9,0],[5,1,9,1],[5,2,5,17],[6,2,6,12],[6,15,6,17],[7,2,9,2],[7,3,7,12],[7,14,9,14],[7,15,7,17],[8,3,9,3],[8,5,9,5],[8,8,9,8],[8,10,9,10],[8,16,9,16],[8,4,9,4],[8,6,9,6],[8,15,9,15],[8,12,9,12],[8,11,9,11],[8,7,9,7],[8,9,9,9],[8,13,9,13]]}
["CONSEJO DE EDUCACIÓN PRIMARIA",null,null,null,null,null,null,null,null,null,null,null,null,null,"ESTUDIANTES MATRICULADOS"]
[]
["Cuadro Nº II-2.2.3"]
[]
["ESTUDIANTES MATRICULADOS EN EDUCACIÓN PRIMARIA PÚBLICA COMÚN POR ÁREA DEMOGRÁFICA Y CATEGORÍA SEGÚN DEPARTAMENTO (Todo el país, 2017)",null,null,null,null,null,null,null,null,null,null,null,null,null,null,null,null,null,null,"VOLVER"]
["DEPARTAMENTO","TOTAL","ÁREA DEMOGRÁFICA"]
[null,null,"URBANA",null,null,null,null,null,null,null,null,null,null,null,null,"RURAL"]
[null,null,"Total Urbana","CATEGORÍA",null,null,null,null,null,null,null,null,null,null,"Total Rural","CATEGORÍA"]
[null,null,null,"Aprender","Aprender H. de Práctica","Común ","Práctica","Tiempo Completo","Habilitada de Práctica","Tiempo Extendido H. de Práctica","Tiempo Extendido de Práctica","Tiempo Extendido","Unidocente","JICI",null,"con Maestro a cargo","Internado Rural","Unidocente"]
[]
["TOTAL",{"$f":"+C11+O11","v":243955},{"$f":"SUM(D11:N11)","v":230690},{"$f":"SUM(D12:D13)","v":70032},2801,72474,17876,38049,21592,458,2095,5173,26,114,{"$f":"SUM(P11:R11)","v":13265},{"$f":"SUM(P12:P13)","v":8915},{"$f":"SUM(Q12:Q13)","v":164},{"$f":"SUM(R12:R13)","v":4186}]
["MONTEVIDEO",{"$f":"+C12+O12","v":76597},{"$f":"SUM(D12:N12)","v":76597},32249,0,23464,4232,11726,1851,288,1273,1400,0,114,0,0,0,0]
["RESTO DEL PAÍS",{"$f":"+C13+O13","v":167358},154093,{"$f":"SUM(D14:D31)","v":37783},2801,49010,13644,26323,19741,170,822,3773,26,0,13265,{"$f":"SUM(P14:P31)","v":8915},{"$f":"SUM(Q14:Q31)","v":164},{"$f":"SUM(R14:R31)","v":4186}]
["Artigas",{"$f":"C14+O14","v":7235},6690,2311,0,1041,597,1526,1121,0,0,94,0,0,545,403,30,112]
["Canelones",41786,39377,12543,907,13712,2126,5716,3838,0,0,535,0,0,2409,2049,27,333]
["Cerro Largo",7597,6868,1751,205,912,737,1473,1220,0,0,570,0,0,729,417,0,312]
["Colonia",10116,9158,156,0,4695,983,1327,1425,0,185,387,0,0,958,549,0,409]
["Durazno",4653,4253,729,0,828,750,875,977,0,0,94,0,0,400,139,0,261]
["Flores",1880,1705,0,0,648,267,438,263,0,0,89,0,0,175,55,21,99]
["Florida",5454,4732,332,0,1746,587,905,808,0,0,354,0,0,722,442,0,280]
["Lavalleja",4131,3731,0,53,1654,524,813,568,0,0,93,26,0,400,189,0,211]
["Maldonado",12415,11926,2779,0,3677,877,1685,2652,0,0,256,0,0,489,332,17,140]
["Paysandú",10089,9274,1853,1003,3146,938,1583,518,0,233,0,0,0,815,532,30,253]
["Río Negro",5230,4768,211,0,2256,441,881,759,0,220,0,0,0,462,302,34,126]
["Rivera",10050,9262,3682,633,1799,780,1651,555,0,0,162,0,0,788,547,0,241]
["Rocha",6313,6043,1185,0,2783,680,1225,0,170,0,0,0,0,270,77,0,193]
["Salto",12135,10997,3630,0,1630,1313,2430,1798,0,0,196,0,0,1138,964,5,169]
["San José",9435,8279,3156,0,2671,85,1244,664,0,184,275,0,0,1156,874,0,282]
["Soriano",7284,6713,1308,0,2494,812,1084,1015,0,0,0,0,0,571,267,0,304]
["Tacuarembó",7611,6666,1795,0,2231,511,897,737,0,0,495,0,0,945,651,0,294]
["Treinta y Tres",3944,3651,362,0,1087,636,570,823,0,0,173,0,0,293,126,0,167]
["Fuente: Procesamiento propio en base a datos proporcionados por el D.E.E .— C.E.I.P."]

{"sheet":"II-2.2.4","index":23,"n_rows":32,"n_cols":11,"rows_kept":32,"cut":false,"hidden":false,"merged":[[0,7,1,9],[6,10,7,10],[5,3,5,10],[4,0,4,10],[32,0,32,9],[5,0,7,1],[5,2,7,2],[6,3,7,3],[6,8,7,8],[6,9,7,9],[6,4,7,4],[6,5,7,5],[6,6,7,6],[6,7,7,7]]}
["CONSEJO DE EDUCACIÓN PRIMARIA",null,null,null,null,null,null,"ESTUDIANTES MATRICULADOS"]
[]
["Cuadro Nº II-2.2.4"]
[]
["ESTUDIANTES MATRICULADOS EN EDUCACIÓN PRIMARIA PÚBLICA ESPECIAL POR TIPO DE DISCAPACIDAD SEGÚN DEPARTAMENTO           (Todo el país, 2017)"]
["DEPARTAMENTO",null,"TOTAL","DISCAPACIDAD"]
[null,null,null,"Auditiva","Intelectual","Motriz","Visual","Problemas de conducta","Problemas de personalidad","Trastornos generalizados del desarrollo","Común"]
[]
["TOTAL",null,{"$f":"SUM(D9:K9)","v":6205},{"$f":"SUM(D11:D12)","v":201},{"$f":"SUM(E11:E12)","v":5488},103,98,35,81,44,{"$f":"SUM(K11:K12)","v":155}]
[]
["MONTEVIDEO",null,{"$f":"SUM(D11:K11)","v":2558},105,2136,103,98,35,81,0,0]
["RESTO DEL PAÍS",null,{"$f":"SUM(D12:K12)","v":3647},{"$f":"SUM(D13:D30)","v":96},{"$f":"SUM(E13:E30)","v":3352},0,0,0,0,44,155]
["Artigas",null,{"$f":"SUM(D13:K13)","v":175},0,166,0,0,0,0,0,9]
["Canelones",null,704,0,654,0,0,0,0,0,50]
["Cerro Largo",null,215,0,206,0,0,0,0,0,9]
["Colonia",null,204,0,200,0,0,0,0,0,4]
["Durazno",null,133,0,127,0,0,0,0,0,6]
["Flores",null,26,0,25,0,0,0,0,0,1]
["Florida",null,140,0,133,0,0,0,0,0,7]
["Lavalleja",null,141,0,136,0,0,0,0,0,5]
["Maldonado",null,307,26,281,0,0,0,0,0,0]
["Paysandú",null,177,0,160,0,0,0,0,0,17]
["Río Negro",null,153,0,149,0,0,0,0,0,4]
["Rivera",null,121,21,100,0,0,0,0,0,0]
["Rocha",null,228,0,204,0,0,0,0,0,24]
["Salto",null,302,49,209,0,0,0,0,44,0]
["San José",null,215,0,208,0,0,0,0,0,7]
["Soriano",null,175,0,173,0,0,0,0,0,2]
["Tacuarembó",null,177,0,171,0,0,0,0,0,6]
["Treinta y Tres",null,54,0,50,0,0,0,0,0,4]
["Fuente: D.E.E. — C.E.P."]
["Nota: No incluye Clases Especiales en Escuelas Comunes"]

{"sheet":"II-2.2.5","index":24,"n_rows":32,"n_cols":46,"rows_kept":32,"cut":false,"hidden":false,"merged":[[8,44,9,44],[8,45,9,45],[5,4,5,45],[6,44,6,45],[7,4,7,45],[8,40,9,40],[8,41,9,41],[8,42,9,42],[8,43,9,43],[8,34,9,34],[8,35,9,35],[8,36,9,36],[8,37,9,37],[8,38,9,38],[8,39,9,39],[8,29,9,29],[0,12,1,17],[8,24,9,24],[8,25,9,25],[8,26,9,26],[8,27,9,27],[4,0,4,15],[5,0,9,0],[5,1,9,1],[5,2,9,2],[5,3,9,3],[6,4,6,5],[6,6,6,7],[8,21,9,21],[8,10,9,10],[8,11,9,11],[8,12,9,12],[8,33,9,33],[8,22,9,22],[8,23,9,23],[8,30,9,30],[8,31,9,31],[8,32,9,32],[8,28,9,28],[8,18,9,18],[8,19,9,19],[8,20,9,20],[8,7,9,7],[8,8,9,8],[8,13,9,13],[8,14,9,14],[8,15,9,15],[8,16,9,16],[8,17,9,17],[6,16,6,17],[8,4,9,4],[8,5,9,5],[8,6,9,6],[6,8,6,9],[6,10,6,11],[6,12,6,13],[6,14,6,15],[8,9,9,9],[6,18,6,19],[6,20,6,21],[6,34,6,35],[6,42,6,43],[6,22,6,23],[6,24,6,25],[6,26,6,27],[6,28,6,29],[6,30,6,31],[6,32,6,33],[6,38,6,39],[6,40,6,41],[6,36,6,37]]}
["CONSEJO DE EDUCACIÓN PRIMARIA",null,null,null,null,null,null,null,null,null,null,null,"ESTUDIANTES MATRICULADOS"]
[]
["Cuadro Nº II-2.2.5"]
[]
["ESTUDIANTES MATRICULADOS EN EDUCACIÓN ESPECIAL PÚBLICA POR EDADES SIMPLES Y SEXO, SEGÚN DEPARTAMENTO (Todo el país, 2017)"]
["DEPARTAMENTO","TOTAL GENERAL","TOTAL MUJERES","TOTAL VARONES","EDAD"]
[null,null,null,null,"Menos de 3 años",null,"3 años",null,"4 años",null,"5 años",null,"6 años",null,"7 años",null,"8 años",null,"9 años",null,"10 años",null,"11 años",null,"12 años",null,"13 años",null,"14 años",null,"15 años",null,"16 años",null,"17 años",null,"18 años",null,"19 años",null,"20 años",null,"21 años",null,"Más de 21 años"]
[null,null,null,null,"SEXO"]
[null,null,null,null,"M","V","M","V","M","V","M","V","M","V","M","V","M","V","M","V","M","V","M","V","M","V","M","V","M","V","M","V","M","V","M","V","M","V","M","V","M","V","M","V","M","V"]
[]
["TOTAL",{"$f":"C11+D11","v":6205},{"$f":"E11+G11+I11+K11+M11+O11+Q11+S11+U11+W11+Y11+AA11+AC11+AE11+AG11+AI11+AK11+AM11+AO11+AQ11+AS11","v":2333},{"$f":"F11+H11+J11+L11+N11+P11+R11+T11+V11+X11+Z11+AB11+AD11+AF11+AH11+AJ11+AL11+AN11+AP11+AR11+AT11","v":3872},{"$f":"SUM(E12:E13)","v":2},3,6,13,18,29,35,65,62,148,123,206,{"$f":"SUM(Q12:Q13)","v":168},290,204,358,239,423,241,400,274,490,290,435,238,387,156,247,125,175,69,89,42,53,16,32,12,12,7,5,6,12]
["MONTEVIDEO",{"$f":"C12+D12","v":2558},974,1584,1,2,2,10,12,13,17,29,24,51,52,67,70,111,73,123,98,177,95,152,108,200,120,171,104,160,58,114,55,81,36,54,29,33,10,19,6,8,3,5,1,4]
["RESTO DEL PAÍS",3647,1359,2288,{"$f":"SUM(E14:E31)","v":1},1,4,3,6,16,18,36,38,97,71,139,98,179,131,235,141,246,146,248,166,290,170,264,134,227,98,133,70,94,33,35,13,20,6,13,6,4,4,0,5,8]
["Artigas",{"$f":"C14+D14","v":175},{"$f":"E14+G14+I14+K14+M14+O14+Q14+S14+U14+W14+Y14+AA14+AC14+AE14+AG14+AI14+AK14+AM14+AO14+AQ14+AS14","v":62},{"$f":"F14+H14+J14+L14+N14+P14+R14+T14+V14+X14+Z14+AB14+AD14+AF14+AH14+AJ14+AL14+AN14+AP14+AR14+AT14","v":113},0,0,0,0,0,1,0,1,1,4,2,8,4,9,7,8,2,14,7,8,12,18,8,11,2,13,9,5,5,9,2,1,1,2,0,1,0,0,0,0,0,0]
["Canelones",704,{"$f":"E15+G15+I15+K15+M15+O15+Q15+S15+U15+W15+Y15+AA15+AC15+AE15+AG15+AI15+AK15+AM15+AO15+AQ15+AS15","v":261},{"$f":"F15+H15+J15+L15+N15+P15+R15+T15+V15+X15+Z15+AB15+AD15+AF15+AH15+AJ15+AL15+AN15+AP15+AR15+AT15","v":443},0,0,0,1,0,2,2,6,9,25,15,19,22,38,31,44,26,48,27,47,39,72,30,62,31,42,13,21,6,11,6,1,2,2,1,1,0,0,0,0,1,1]
["Cerro Largo",215,84,131,0,0,0,0,0,1,1,0,3,8,3,5,6,10,6,14,12,8,7,14,8,21,9,15,7,14,10,8,5,4,2,3,3,4,0,0,1,1,1,0,0,1]
["Colonia",204,86,118,0,0,0,1,1,2,4,1,2,6,5,8,12,9,10,9,10,9,6,14,8,10,7,15,9,12,6,10,3,8,1,4,1,0,0,0,1,0,0,0,0,0]
["Durazno",133,43,90,0,0,0,0,0,0,0,1,0,1,2,5,1,4,3,12,4,9,6,6,4,11,5,10,9,6,1,8,5,5,2,3,0,3,1,4,0,0,0,0,0,2]
["Flores",26,8,18,0,0,0,0,0,0,0,0,0,0,0,3,0,0,0,2,2,1,2,3,2,1,1,1,0,1,0,1,0,2,1,0,0,1,0,1,0,1,0,0,0,0]
["Florida",140,52,88,0,0,0,0,0,0,0,2,2,1,0,5,1,10,5,8,3,7,7,6,9,12,7,16,9,7,3,8,1,4,1,1,2,0,1,0,0,1,0,0,1,0]
["Lavalleja",141,47,94,0,0,1,0,1,1,1,3,1,6,4,11,1,4,1,7,1,11,10,8,4,9,8,6,4,10,3,8,6,9,1,1,0,0,0,0,0,0,0,0,0,0]
["Maldonado",307,126,181,0,0,1,1,1,3,3,8,1,8,8,13,10,14,9,19,12,20,14,24,23,17,16,16,10,20,6,9,5,3,3,2,1,2,1,2,1,0,0,0,1,0]
["Paysandú",177,55,122,0,0,0,0,0,0,2,3,1,7,4,7,5,17,5,11,9,18,6,18,5,12,9,13,6,13,1,1,0,0,1,1,0,0,0,0,0,0,0,0,1,1]
["Río Negro",153,52,101,0,0,0,0,1,0,1,1,2,7,2,6,6,9,7,13,4,17,5,11,3,17,8,6,4,5,4,4,2,4,2,1,1,0,0,0,0,0,0,0,0,0]
["Rivera",121,56,65,0,0,0,0,0,0,0,0,3,1,1,3,3,4,5,7,10,5,6,11,8,6,8,11,4,9,4,3,2,5,0,0,0,0,0,0,0,0,2,0,0,0]
["Rocha",228,86,142,0,1,0,0,0,1,2,3,3,6,4,12,6,13,10,20,11,15,10,13,9,17,16,14,2,12,3,4,4,5,2,0,1,2,0,1,2,0,1,0,0,3]
["Salto",302,116,186,0,0,2,0,1,4,2,4,4,7,10,8,8,6,13,21,8,22,8,23,8,22,9,22,13,20,12,16,11,8,7,2,0,0,0,1,0,0,0,0,0,0]
["San José",215,70,145,0,0,0,0,0,0,0,1,1,4,4,7,3,7,5,14,10,13,10,17,6,21,8,17,8,18,9,15,5,6,1,4,0,0,0,1,0,0,0,0,0,0]
["Soriano",175,58,117,0,0,0,0,0,0,0,2,4,4,2,9,3,12,4,10,4,15,4,13,4,13,13,13,7,14,5,4,6,5,0,1,0,0,0,1,1,1,0,0,1,0]
["Tacuarembó",177,69,108,1,0,0,0,1,1,0,0,1,2,3,9,6,11,6,13,9,11,10,10,5,8,5,11,9,9,8,5,2,5,0,9,1,4,2,0,0,0,0,0,0,0]
["Treinta y Tres",54,28,26,0,0,0,0,0,0,0,0,0,0,2,1,1,2,4,3,4,3,1,2,9,3,3,5,0,2,1,3,2,1,1,1,0,0,0,0,0,0,0,0,0,0]
["Fuente: Procesamiento propio en base a datos proporcionados por el DEE — CEIP"]

{"sheet":"II-2.2.6","index":25,"n_rows":126,"n_cols":46,"rows_kept":126,"cut":false,"hidden":false,"merged":[[0,3,1,5],[4,0,4,5],[5,0,8,0],[5,1,5,5],[6,1,8,1],[6,2,6,4],[6,5,8,5],[7,2,8,2],[7,3,8,3],[7,4,8,4]]}
["CONSEJO DE EDUCACIÓN PRIMARIA",null,null,"ESTUDIANTES MATRICULADOS"]
[]
["Cuadro Nº II-2.2.6"]
[]
["ESTUDIANTES MATRICULADOS EN EDUCACIÓN PRIMARIA PRIVADA POR TIPO DE EDUCACIÓN SEGÚN DEPARTAMENTO (Todo el país, 2017)"]
["DEPARTAMENTO","TIPO DE EDUCACIÓN"]
[null,"TOTAL","EDUCACIÓN COMÚN",null,null,"EDUCACIÓN ESPECIAL"]
[null,null,"Total","Habilitados","Autorizados"]
[]
["TOTAL DEL PAÍS",{"$f":"SUM(B11:B12)","v":54262.999999999985},{"$f":"+D10+E10","v":51832.999999999985},{"$f":"D11+D12","v":49165.999999999985},{"$f":"E11+E12","v":2667},{"$f":"F11+F12","v":2430}]
["MONTEVIDEO",{"$f":"+C11+F11","v":33392.999999999985},{"$f":"+D11+E11","v":31959.999999999989},29753.999999999989,2206,1433,null,null,null,null,null,null,null,null,null,null,null,null,null,null,null,null,null,null,null,null,null,null,null,null,null,null,null,null,null,null,null,null,null,null,null,null,null,null,null,"MONTEVIDEO"]
["RESTO DEL PAÍS",{"$f":"+C12+F12","v":20870},{"$f":"+D12+E12","v":19873},{"$f":"SUM(D13:D30)","v":19412},{"$f":"SUM(E13:E30)","v":461},{"$f":"SUM(F13:F30)","v":997},null,null,null,null,null,null,null,null,null,null,null,null,null,null,null,null,null,null,null,null,null,null,null,null,null,null,null,null,null,null,null,null,null,null,null,null,null,null,null,"RESTO DEL PAÍS"]
["Artigas",{"$f":"+C13+F13","v":329},{"$f":"+D13+E13","v":185},185,0,144,null,null,null,null,null,null,null,null,null,null,null,null,null,null,null,null,null,null,null,null,null,null,null,null,null,null,null,null,null,null,null,null,null,null,null,null,null,null,null,"Artigas"]
["Canelones",7741.0000000000009,{"$f":"+D14+E14","v":7618.0000000000009},7183.0000000000009,435,123,null,null,null,null,null,null,null,null,null,null,null,null,null,null,null,null,null,null,null,null,null,null,null,null,null,null,null,null,null,null,null,null,null,null,null,null,null,null,null,"Canelones"]
["Cerro Largo",615,615,615,0,0,null,null,null,null,null,null,null,null,null,null,null,null,null,null,null,null,null,null,null,null,null,null,null,null,null,null,null,null,null,null,null,null,null,null,null,null,null,null,null,"Cerro Largo"]
["Colonia",771,743,743,0,28,null,null,null,null,null,null,null,null,null,null,null,null,null,null,null,null,null,null,null,null,null,null,null,null,null,null,null,null,null,null,null,null,null,null,null,null,null,null,null,"Colonia"]
["Durazno",550,550,550,0,0,null,null,null,null,null,null,null,null,null,null,null,null,null,null,null,null,null,null,null,null,null,null,null,null,null,null,null,null,null,null,null,null,null,null,null,null,null,null,null,"Durazno"]
["Flores",252,252,252,0,0,null,null,null,null,null,null,null,null,null,null,null,null,null,null,null,null,null,null,null,null,null,null,null,null,null,null,null,null,null,null,null,null,null,null,null,null,null,null,null,"Flores"]
["Florida",298,248,248,0,50,null,null,null,null,null,null,null,null,null,null,null,null,null,null,null,null,null,null,null,null,null,null,null,null,null,null,null,null,null,null,null,null,null,null,null,null,null,null,null,"Florida"]
["Lavalleja",555,555,555,0,0,null,null,null,null,null,null,null,null,null,null,null,null,null,null,null,null,null,null,null,null,null,null,null,null,null,null,null,null,null,null,null,null,null,null,null,null,null,null,null,"Lavalleja"]
["Maldonado",3468.0000000000005,3376.0000000000005,3376.0000000000005,0,92,null,null,null,null,null,null,null,null,null,null,null,null,null,null,null,null,null,null,null,null,null,null,null,null,null,null,null,null,null,null,null,null,null,null,null,null,null,null,null,"Maldonado"]
["Paysandú",1242,1128,1128,0,114,null,null,null,null,null,null,null,null,null,null,null,null,null,null,null,null,null,null,null,null,null,null,null,null,null,null,null,null,null,null,null,null,null,null,null,null,null,null,null,"Paysandú"]
["Río Negro",492,492,476,16,0,null,null,null,null,null,null,null,null,null,null,null,null,null,null,null,null,null,null,null,null,null,null,null,null,null,null,null,null,null,null,null,null,null,null,null,null,null,null,null,"Río Negro"]
["Rivera",567.00000000000011,567.00000000000011,567.00000000000011,0,0,null,null,null,null,null,null,null,null,null,null,null,null,null,null,null,null,null,null,null,null,null,null,null,null,null,null,null,null,null,null,null,null,null,null,null,null,null,null,null,"Rivera"]
["Rocha",283,283,283,0,0,null,null,null,null,null,null,null,null,null,null,null,null,null,null,null,null,null,null,null,null,null,null,null,null,null,null,null,null,null,null,null,null,null,null,null,null,null,null,null,"Rocha"]
["Salto",1362,1163,1163,0,199,null,null,null,null,null,null,null,null,null,null,null,null,null,null,null,null,null,null,null,null,null,null,null,null,null,null,null,null,null,null,null,null,null,null,null,null,null,null,null,"Salto"]
["San José",738,738,728,10,0,null,null,null,null,null,null,null,null,null,null,null,null,null,null,null,null,null,null,null,null,null,null,null,null,null,null,null,null,null,null,null,null,null,null,null,null,null,null,null,"San José"]
["Soriano",702,455,455,0,247,null,null,null,null,null,null,null,null,null,null,null,null,null,null,null,null,null,null,null,null,null,null,null,null,null,null,null,null,null,null,null,null,null,null,null,null,null,null,null,"Soriano"]
["Tacuarembó",712.99999999999989,712.99999999999989,712.99999999999989,0,0,null,null,null,null,null,null,null,null,null,null,null,null,null,null,null,null,null,null,null,null,null,null,null,null,null,null,null,null,null,null,null,null,null,null,null,null,null,null,null,"Tacuarembó"]
["Treinta y Tres",192,192,192,0,0,null,null,null,null,null,null,null,null,null,null,null,null,null,null,null,null,null,null,null,null,null,null,null,null,null,null,null,null,null,null,null,null,null,null,null,null,null,null,null,"Treinta y Tres"]
["Fuente: Procesamiento propio en base a datos proporcionados por el D.E.E. — C.E.I.P."]
["Nota: Especial incluye la matrícula de clases especiales en escuelas comunes, "]
["      Instrucción Temprana, Educación Inicial, Preparatorio y Talleres"]
[]
[]
[]
[]
[]
[]
[]
[]
[]
[]
[]
[]
[]
[]
[]
[]
[]
[]
[]
[]
[]
[]
[]
[]
[]
[]
[]
[]
[]
[]
[]
[]
[]
[]
[]
[]
[]
[]
[]
[]
[]
[]
[]
[]
[]
[]
[]
[]
[]
[]
[]
[]
[]
[]
[]
[]
[]
[]
[]
[]
[]
[]
[]
[]
[]
[]
[]
[]
[]
[]
[]
[]
[]
["30025 "," 2163",2209]
[19484,397,1758]
[92,0,162]
[6669,344,0]
[615,0,0]
[724,0,0]
[634,0,0]
[361,0,7]
[296,0,62]
[615,0,0]
[3879,0,141]
[1175,0,276]
[428,33,149]
[673,0,7]
[413,0,87]
[1089,0,208]
[556,20,0]
[435,0,659]
[643,0,0]
[187,0,0]

{"sheet":"II-2.2.7","index":26,"n_rows":32,"n_cols":44,"rows_kept":32,"cut":false,"hidden":false,"merged":[[8,40,9,40],[8,41,9,41],[8,42,9,42],[8,43,9,43],[8,34,9,34],[8,35,9,35],[8,36,9,36],[8,37,9,37],[8,38,9,38],[8,39,9,39],[8,20,9,20],[8,33,9,33],[8,22,9,22],[8,23,9,23],[8,24,9,24],[8,25,9,25],[8,26,9,26],[8,27,9,27],[8,28,9,28],[8,29,9,29],[8,30,9,30],[8,31,9,31],[8,32,9,32],[8,4,9,4],[8,5,9,5],[8,6,9,6],[8,7,9,7],[8,8,9,8],[8,9,9,9],[6,34,6,35],[6,36,6,37],[6,38,6,39],[6,40,6,41],[8,21,9,21],[8,10,9,10],[8,11,9,11],[8,12,9,12],[8,13,9,13],[8,14,9,14],[8,15,9,15],[8,16,9,16],[8,17,9,17],[8,18,9,18],[8,19,9,19],[6,30,6,31],[6,32,6,33],[6,10,6,11],[6,12,6,13],[6,14,6,15],[6,16,6,17],[6,18,6,19],[6,20,6,21],[4,0,4,17],[0,13,1,20],[5,0,9,0],[5,1,9,1],[5,2,9,2],[5,3,9,3],[5,4,5,43],[6,4,6,5],[6,6,6,7],[6,8,6,9],[6,42,6,43],[7,4,7,43],[6,22,6,23],[6,24,6,25],[6,26,6,27],[6,28,6,29]]}
["CONSEJO DE EDUCACIÓN PRIMARIA",null,null,null,null,null,null,null,null,null,null,null,null,"ESTUDIANTES MATRICULADOS"]
[]
["Cuadro Nº II-2.2.7"]
[]
["ESTUDIANTES MATRICULADOS EN EDUCACIÓN ESPECIAL PRIVADA POR EDADES SIMPLES Y SEXO SEGÚN DEPARTAMENTO                (Todo el país, 2017)"]
["DEPARTAMENTO","TOTAL GENERAL","TOTAL VARONES","TOTAL MUJERES","EDAD"]
[null,null,null,null,"Menos de 3 años",null,"3 años",null,"4 años",null,"5 años",null,"6 años",null,"7 años",null,"8 años",null,"9 años",null,"10 años",null,"11 años",null,"12 años",null,"13 años",null,"14 años",null,"15 años",null,"16 años",null,"17 años",null,"18 años",null,"19 años",null,"20 años",null,"21 años"]
[null,null,null,null,"SEXO"]
[null,null,null,null,"V","M","V","M","V","M","V","M","V","M","V","M","V","M","V","M","V","M","V","M","V","M","V","M","V","M","V","M","V","M","V","M","V","M","V","M","V","M","V","M"]
[]
["TOTAL",{"$f":"C11+D11","v":2430},{"$f":"E11+G11+I11+K11+M11+O11+Q11+S11+U11+W11+Y11+AA11+AC11+AE11+AG11+AI11+AK11+AM11+AO11+AQ11","v":1259},{"$f":"F11+H11+J11+L11+N11+P11+R11+T11+V11+X11+Z11+AB11+AD11+AF11+AH11+AJ11+AL11+AN11+AP11+AR11","v":1171},{"$f":"SUM(E12:E13)","v":4},5,2,1,7,3,22,13.000000000000002,54,32,51,24,55,14.000000000000002,57,41.999999999999993,65,25,43,28,68,32,43,34,39,33,45,48,47,50.000000000000007,50,38,59.000000000000007,60,40,91.000000000000014,44,119.00000000000001,464,479.00000000000006]
["MONTEVIDEO",{"$f":"C12+D12","v":1433},{"$f":"E12+G12+I12+K12+M12+O12+Q12+S12+U12+W12+Y12+AA12+AC12+AE12+AG12+AI12+AK12+AM12+AO12+AQ12","v":701},{"$f":"F12+H12+J12+L12+N12+P12+R12+T12+V12+X12+Z12+AB12+AD12+AF12+AH12+AJ12+AL12+AN12+AP12+AR12","v":732},0,2,0,0,2,1,15,10.000000000000002,32,15,24.000000000000004,17,41,10.000000000000002,26.999999999999996,23.999999999999993,36.000000000000007,10.999999999999998,33,20,45.999999999999993,22,23,22,16.999999999999996,16.999999999999996,20.999999999999996,28.000000000000004,30,33.000000000000007,30,22,28.000000000000007,28,25,74.000000000000014,15,96.000000000000014,256,280.00000000000006]
["RESTO DEL PAÍS",997,558,439,{"$f":"SUM(E14:E31)","v":4},{"$f":"SUM(F14:F31)","v":3},2,1,5,2,7,3,22,17,27,7,14,4,30,18,29,14,10,8,22,10,20,12,22,16,24,20,17,17,20,16,31,32,15,17,29,23,208,199]
["Artigas",144,73,71,0,0,0,0,0,0,0,0,4,3,1,2,3,0,0,0,0,0,2,0,0,0,5,0,1,3,2,2,6,5,2,1,7,1,5,4,3,2,32,48]
["Canelones",123,76,47,0,0,0,0,0,0,0,0,0,0,0,0,1,0,1,0,1,0,0,1,0,1,0,1,3,0,3,1,2,3,4,0,2,1,4,0,14,8,41,31]
["Cerro Largo",0,0,0,0,0,0,0,0,0,0,0,0,0,0,0,0,0,0,0,0,0,0,0,0,0,0,0,0,0,0,0,0,0,0,0,0,0,0,0,0,0,0,0]
["Colonia",28,17,11,0,0,0,0,0,0,0,0,0,0,0,0,0,0,0,0,0,0,0,0,0,1,3,0,2,3,2,1,5,1,1,2,0,1,0,0,1,0,3,2]
["Durazno",0,0,0,0,0,0,0,0,0,0,0,0,0,0,0,0,0,0,0,0,0,0,0,0,0,0,0,0,0,0,0,0,0,0,0,0,0,0,0,0,0,0,0]
["Flores",0,0,0,0,0,0,0,0,0,0,0,0,0,0,0,0,0,0,0,0,0,0,0,0,0,0,0,0,0,0,0,0,0,0,0,0,0,0,0,0,0,0,0]
["Florida",50,24,26,0,3,1,1,1,1,3,0,0,0,0,0,0,0,0,0,0,0,0,0,0,0,1,1,2,1,2,1,0,1,0,1,1,1,1,0,1,1,11,14]
["Lavalleja",0,0,0,0,0,0,0,0,0,0,0,0,0,0,0,0,0,0,0,0,0,0,0,0,0,0,0,0,0,0,0,0,0,0,0,0,0,0,0,0,0,0,0]
["Maldonado",92,47,45,0,0,0,0,1,0,0,0,0,1,0,0,0,1,0,2,1,0,1,2,1,2,0,0,6,3,2,2,2,1,0,2,7,6,0,5,7,7,19,11]
["Paysandú",114,60,54,3,0,0,0,0,1,1,3,2,0,1,0,0,0,0,0,0,0,0,0,0,0,0,1,1,0,1,4,0,2,6,3,6,12,1,3,3,5,35,20]
["Río Negro",0,0,0,0,0,0,0,0,0,0,0,0,0,0,0,0,0,0,0,0,0,0,0,0,0,0,0,0,0,0,0,0,0,0,0,0,0,0,0,0,0,0,0]
["Rivera",0,0,0,0,0,0,0,0,0,0,0,0,0,0,0,0,0,0,0,0,0,0,0,0,0,0,0,0,0,0,0,0,0,0,0,0,0,0,0,0,0,0,0]
["Rocha",0,0,0,0,0,0,0,0,0,0,0,0,0,0,0,0,0,0,0,0,0,0,0,0,0,0,0,0,0,0,0,0,0,0,0,0,0,0,0,0,0,0,0]
["Salto",199,127,72,0,0,0,0,0,0,1,0,15,11,15,5,6,2,25,11,20,12,2,3,16,4,7,8,2,1,3,2,1,1,5,1,1,4,1,2,0,0,7,5]
["San José",0,0,0,0,0,0,0,0,0,0,0,0,0,0,0,0,0,0,0,0,0,0,0,0,0,0,0,0,0,0,0,0,0,0,0,0,0,0,0,0,0,0,0]
["Soriano",247,134,113,1,0,1,0,3,0,2,0,1,2,10,0,4,1,4,5,7,2,5,2,5,2,4,1,5,5,9,7,1,3,2,6,7,6,3,3,0,0,60,68]
["Tacuarembó",0,0,0,0,0,0,0,0,0,0,0,0,0,0,0,0,0,0,0,0,0,0,0,0,0,0,0,0,0,0,0,0,0,0,0,0,0,0,0,0,0,0,0]
["Treinta y Tres",0,0,0,0,0,0,0,0,0,0,0,0,0,0,0,0,0,0,0,0,0,0,0,0,0,0,0,0,0,0,0,0,0,0,0,0,0,0,0,0,0,0,0]
["Fuente: Procesamiento propio en base a datos proporcionados por el DEE — CEIP"]

{"sheet":"II-2.2.8","index":27,"n_rows":24,"n_cols":15,"rows_kept":24,"cut":false,"hidden":false,"merged":[[6,11,7,12],[6,13,7,14],[8,3,8,14],[0,12,1,14],[2,0,3,1],[4,0,4,14],[5,0,9,0],[5,3,5,14],[6,1,8,2],[6,3,7,4],[6,5,7,6],[6,7,7,8],[6,9,7,10]]}
["CONSEJO DE EDUCACIÓN PRIMARIA",null,null,null,null,null,null,null,null,null,null,null,"ESTUDIANTES MATRICULADOS"]
[]
["Cuadro Nº II-2.2.8"]
[]
["ESTUDIANTES MATRICULADOS EN EDUCACIÓN PRIMARIA COMÚN POR GRADO Y FORMA DE ADMINISTRACIÓN SEGÚN EDAD(Todo el país, 2017)"]
["EDAD",null,null,"GRADO"]
[null,"TOTAL",null,"Primero",null,"Segundo",null,"Tercero",null,"Cuarto",null,"Quinto",null,"Sexto"]
[]
[null,null,null,"FORMA DE ADMINISTRACIÓN"]
[null,"Pública","Privada","Pública","Privada","Pública","Privada","Pública","Privada","Pública","Privada","Pública","Privada","Pública","Privada"]
["TOTAL",{"$f":"SUM(B13:B22)","v":243841},{"$f":"SUM(C13:C22)","v":0},{"$f":"SUM(D13:D22)","v":43075},{"$f":"SUM(E13:E22)","v":0},{"$f":"SUM(F13:F22)","v":40505},0,{"$f":"SUM(H13:H22)","v":40239},0,{"$f":"SUM(J13:J22)","v":39984},0,{"$f":"SUM(L13:L22)","v":40155},0,{"$f":"SUM(N13:N22)","v":39883},0]
[]
["5  años",{"$f":"+D13+F13+H13+J13+L13+N13","v":45},{"$f":"+E13+G13+I13+K13+M13+O13","v":0},45,null,0,null,0,null,0,null,0,null,0]
["6  años",37807,{"$f":"+E14+G14+I14+K14+M14+O14","v":0},37737,null,70,null,0,null,0,null,0,null,0]
["7  años",37835,0,5000,null,32701,null,134,null,0,null,0,null,0]
["8  años",38043,0,257,null,6743,null,30944,null,99,null,0,null,0]
["9  años",38559,0,18,null,912,null,7556,null,29971,null,102,null,0]
["10 años",39502,0,3,null,61,null,1418,null,7826,null,30060,null,134]
["11 años",38544,0,3,null,10,null,149,null,1811,null,7656,null,28915]
["12 años",10529,0,0,null,3,null,22,null,232,null,2028,null,8244]
["13 años",2563,0,2,null,0,null,8,null,31,null,264,null,2258]
["14 años y más",414,0,10,null,5,null,8,null,14,null,45,null,332]
["Fuente: Procesamiento propio en base a datos proporcionados por el D.E.E .— C.E.I.P."]
["Nota:   Primaria Pública no incluye la matrícula correspondiente a JICI "]

{"sheet":"II-2.2.9","index":28,"n_rows":22,"n_cols":16,"rows_kept":22,"cut":false,"hidden":false,"merged":[[5,14,5,15],[6,4,6,15],[0,12,1,15],[3,0,3,15],[4,0,7,0],[4,4,4,15],[5,2,6,3],[5,4,5,5],[5,6,5,7],[5,8,5,9],[5,10,5,11],[5,12,5,13]]}
["CONSEJO DE EDUCACIÓN PRIMARIA",null,null,null,null,null,null,null,null,null,null,null,"ESTUDIANTES MATRICULADOS"]
[]
["Cuadro Nº II-2.2.9"]
["ESTUDIANTES MATRICULADOS EN EDUCACIÓN PRIMARIA COMÚN PÚBLICA POR GRADO Y SEXO SEGÚN EDAD (Todo el país, 2017)"]
["EDAD",null,null,null,"GRADO"]
[null,null,"TOTAL SEXO",null,"Primero",null,"Segundo",null,"Tercero",null,"Cuarto",null,"Quinto",null,"Sexto"]
[null,null,null,null,"SEXO"]
[null,"TOTAL","VARÓN","MUJER","V","M","V","M","V","M","V","M","V","M","V","M"]
["TOTAL",{"$f":"+C9+D9","v":243841},{"$f":"SUM(E9+G9+I9+K9+M9+O9)","v":125288},{"$f":"+F9+H9+J9+L9+N9+P9","v":118553},{"$f":"SUM(E11:E20)","v":22354},{"$f":"SUM(F11:F20)","v":20721},20954,19551,20750,19489,20301,19683,20472,19683,20457,19426]
[]
["5  años",{"$f":"+C11+D11","v":62},{"$f":"SUM(E11+G11+I11+K11+M11+O11)","v":34},{"$f":"+F11+H11+J11+L11+N11+P11","v":28},25,20,0,0,2,1,1,1,3,2,3,4]
["6  años",{"$f":"+C12+D12","v":37809},{"$f":"SUM(E12+G12+I12+K12+M12+O12)","v":19144},{"$f":"+F12+H12+J12+L12+N12+P12","v":18665},19116,18621,28,42,0,2,0,0,0,0,0,0]
["7  años",{"$f":"+C13+D13","v":37833},{"$f":"SUM(E13+G13+I13+K13+M13+O13)","v":19281},{"$f":"+F13+H13+J13+L13+N13+P13","v":18552},3034,1966,16195,16506,50,79,2,0,0,1,0,0]
["8  años",38040,19452,18588,160,97,4115,2628,15126,15818,51,44,0,0,0,1]
["9  años",{"$f":"+C15+D15","v":38553},{"$f":"SUM(E15+G15+I15+M15+K15+O15)","v":19590},{"$f":"+F15+H15+J15+N15+L15+P15","v":18963},13,5,573,339,4577,2979,14381,15590,46,50,0,0]
["10 años",39494,{"$f":"SUM(E16+G16+I16+M16+K16+O16)","v":19992},{"$f":"+F16+H16+J16+N16+L16+P16","v":19502},1,2,33,28,884,534,4570,3256,14443,15617,61,65]
["11 años",38544,19632,{"$f":"+F17+H17+J17+N17+L17+P17","v":18912},0,3,6,4,87,62,1121,690,4475,3181,13943,14972]
["12 años",10529,6301,4228,0,0,2,1,17,5,146,86,1313,715,4823,3421]
["13 años",2563,1602,961,1,1,0,0,3,5,23,8,163,101,1412,846]
["14 años y más",414,260,154,4,6,2,3,4,4,6,8,29,16,215,117]
["Fuente: Procesamiento propio en base a datos proporcionados por el D.E.E. — C.E.I.P."]
["Nota:   Primaria Pública no incluye la matrícula correspondiente a JICI "]

{"sheet":"II-2.2.10","index":29,"n_rows":20,"n_cols":16,"rows_kept":20,"cut":false,"hidden":false,"merged":[[5,12,5,13],[5,14,5,15],[6,4,6,15],[0,12,1,15],[2,0,2,2],[3,0,3,15],[4,0,7,0],[4,4,4,15],[5,1,6,3],[5,4,5,5],[5,6,5,7],[5,8,5,9],[5,10,5,11]]}
["CONSEJO DE EDUCACIÓN PRIMARIA",null,null,null,null,null,null,null,null,null,null,null,"ESTUDIANTES MATRICULADOS"]
[]
["Cuadro Nº II-2.2.10"]
["ESTUDIANTES MATRICULADOS EN EDUCACIÓN PRIMARIA COMÚN PRIVADA POR GRADO Y SEXO SEGÚN EDAD (Todo el país, 2017)"]
["EDAD",null,null,null,"GRADO"]
[null,"TOTAL SEXO",null,null,"Primero",null,"Segundo",null,"Tercero",null,"Cuarto",null,"Quinto",null,"Sexto"]
[null,null,null,null,"SEXO"]
[null,"TOTAL","VARÓN","MUJER","V","M","V","M","V","M","V","M","V","M","V","M"]
["TOTAL",53526,27144.999999999996,26381,4771,4563,4681.9999999999982,4425,4402.9999999999991,4304.0000000000009,4535,4426,4398,4233,4356,4429.9999999999991]
["6  años",8113,4113,4000,4113,4000,0,0,0,0,0,0,0,0,0,0]
["7  años",8965.9999999999982,4592.9999999999982,4373,638,546,3954.9999999999982,3827,0,0,0,0,0,0,0,0]
["8  años",8712,4421.9999999999991,4290.0000000000009,20,15,694,577.00000000000011,3707.9999999999991,3698.0000000000009,0,0,0,0,0,0]
["9  años",8789,4456,4333,0,2,27.999999999999993,16.999999999999993,656,583.99999999999977,3772,3730,0,0,0,0]
["10 años",8474,4268,4206,0,0,4.0000000000000036,1.9999999999999984,36.999999999999979,18.999999999999996,707,668,3520,3517,0,0]
["11 años",8818,4421,4396.9999999999991,0,0,0.99999999999999922,1.9999999999999984,0.999999999999999,0,46,19,806,682,3567.0000000000005,3693.9999999999991]
["12 años",1527.9999999999995,798.9999999999992,729.00000000000023,0,0,0,0,0.99999999999999978,1.9999999999999998,10,8,63,28,724.9999999999992,691.00000000000023]
["13 años",97,57,40.000000000000007,0,0,0,0,0,0.99999999999999922,0,0,6,4,51,35.000000000000007]
["14 años y más",28.999999999999996,16,12.999999999999996,0,0,0,0,0,0,0,1,3,2,13,9.9999999999999964]
["Fuente: Procesamiento propio en base a datos proporcionados por el D.E.E. — C.E.I.P."]
["Debido a dificultades con los sistemas de información, se reporta 2016 como último año válido."]

{"sheet":"II-2.2.11","index":30,"n_rows":33,"n_cols":15,"rows_kept":33,"cut":false,"hidden":false,"merged":[[0,11,1,14],[8,9,9,9],[8,10,9,10],[8,11,9,11],[8,12,9,12],[8,13,9,13],[4,0,4,14],[5,0,9,0],[5,1,5,14],[6,1,7,2],[6,3,6,4],[6,5,6,6],[6,7,6,8],[6,9,6,10],[6,11,6,12],[8,14,9,14],[6,13,6,14],[7,3,7,14],[8,1,9,1],[8,2,9,2],[8,3,9,3],[8,4,9,4],[8,5,9,5],[8,6,9,6],[8,7,9,7],[8,8,9,8]]}
["CONSEJO DE EDUCACIÓN PRIMARIA",null,null,null,null,null,null,null,null,null,null,"ESTUDIANTES MATRICULADOS"]
[]
["Cuadro Nº II-2.2.11"]
[]
["ESTUDIANTES MATRICULADOS EN EDUCACIÓN PRIMARIA COMÚN POR GRADO Y FORMA DE ADMINISTRACIÓN SEGÚN DEPARTAMENTO (Todo el país, 2017)"]
["DEPARTAMENTO","GRADO"]
[null,"TOTAL",null,"Primero",null,"Segundo",null,"Tercero",null,"Cuarto",null,"Quinto",null,"Sexto"]
[null,null,null,"FORMA DE ADMINISTRACIÓN"]
[null,"Pública","Privada","Pública","Privada","Pública","Privada","Pública","Privada","Pública","Privada","Pública","Privada","Pública","Privada"]
[]
["TOTAL",{"$f":"SUM(B12:B13)","v":243841},51833.000000000007,43075,8894.0000000000036,40505,8843.0000000000018,40239,8653.9999999999964,39984,8319.0000000000018,40155,8689,39883,8434]
["MONTEVIDEO",{"$f":"+D12+F12+H12+J12+L12+N12","v":76483},{"$f":"+E12+G12+I12+K12+M12+O12","v":31960.000000000007},14287,5535.0000000000036,12960,5446.0000000000018,12570,5337.9999999999973,12445,5128.0000000000018,12333,5307.9999999999991,11888,5205.0000000000009]
["RESTO DEL PAÍS",{"$f":"SUM(B14:B31)","v":167358},{"$f":"SUM(C14:C31)","v":19873},28788,3359.0000000000005,27545,3397,27669,3316,27539,3190.9999999999995,27822,3381,27995,3228.9999999999995]
["Artigas",{"$f":"+D14+F14+H14+J14+L14+N14","v":7235},{"$f":"+E14+G14+I14+K14+M14+O14","v":185},1157,33,1245,29,1246,35,1237,31,1126,32,1224,25]
["Canelones",{"$f":"+D15+F15+H15+J15+L15+N15","v":41786},{"$f":"+E15+G15+I15+K15+M15+O15","v":7618},7395,1335.0000000000005,6841,1283.9999999999998,6771,1285,6891,1237.9999999999998,6981,1247.9999999999998,6907,1227.9999999999995]
["Cerro Largo",{"$f":"+D16+F16+H16+J16+L16+N16","v":7597},615,1259,105,1228,98,1283,108.99999999999999,1247,88,1268,118,1312,97]
["Colonia",{"$f":"+D17+F17+H17+J17+L17+N17","v":10116},743,1757,116,1671,133,1697,127.00000000000001,1616,120,1668,126,1707,121.00000000000001]
["Durazno",4653,550,738,86,815,94,749,86,783,95,769,109,799,80]
["Flores",1880,252,313,41,316,37,314,40,318,36,304,40,315,58]
["Florida",5454,248,970,42,851,54,882,44,920,27,905,44,926,37]
["Lavalleja",4131,555,654,95,682,82,619,105,684,79,746,92,746,102]
["Maldonado",12415,3376,2072,533,2000,551,2076,544,2054,561.99999999999989,2092,602,2121,584]
["Paysandú",10089,1128,1691,195.00000000000003,1584,187.00000000000003,1633,200.99999999999997,1684,192.99999999999997,1776,185,1721,167.00000000000003]
["Río Negro",5230,492,890,74,935,87,882,102,824,72,883,82,816,75]
["Rivera",10050,567,1723,102.00000000000001,1704,107,1729,90,1569,93,1658,91.000000000000014,1667,84]
["Rocha",6313,283,1129,53,1075,56,1042,45,1049,37,995,46,1023,46]
["Salto",12135,1163,2186,196.00000000000003,1974,206,2063,195,1958,167.99999999999997,1986,181,1968,216.99999999999997]
["San José",9435,738,1627,126.00000000000003,1564,148,1567,114,1596,120.00000000000003,1535,126,1546,103.99999999999999]
["Soriano",7284,455,1207,75,1167,85,1212,69,1257,66,1222,86,1219,74]
["Tacuarembó",7611,713,1325,116.99999999999999,1227,123.00000000000001,1252,103,1249,139,1255,129,1303,102]
["Treinta y Tres",3944,192,695,35,666,36,652,22,603,27,653,44,675,28]
["Fuente: Procesamiento propio en base a datos proporcionados por el DEE — CEIP"]
["Nota:   Primaria Pública no incluye la matrícula correspondiente a JICI "]

{"sheet":"II-2.2.12","index":31,"n_rows":20,"n_cols":7,"rows_kept":20,"cut":false,"hidden":false,"merged":[[19,0,19,6],[0,5,1,6],[4,0,4,6],[5,0,9,0],[5,1,5,6],[6,1,6,3],[6,4,6,6],[7,1,9,1],[7,2,7,3],[7,4,9,4],[7,5,7,6],[8,2,9,2],[8,3,9,3],[8,5,9,5],[8,6,9,6]]}
["CONSEJO DE EDUCACIÓN PRIMARIA",null,null,null,null,"RENDIMIENTO ESCOLAR"]
[]
["Cuadro Nº II-2.2.12"]
[]
["RENDIMIENTO ESCOLAR EN EDUCACIÓN PRIMARIA COMÚN PÚBLICA POR ÁREA DEMOGRÁFICA SEGÚN GRADO (Todo el país, 2017)"]
["GRADO","RENDIMIENTO ESCOLAR"]
[null,"PROMOVIDOS",null,null,"NO PROMOVIDOS"]
[null,"TOTAL","ÁREA DEMOGRÁFICA",null,"TOTAL","ÁREA DEMOGRÁFICA"]
[null,null,"Urbana","Rural",null,"Urbana","Rural"]
[]
["TOTAL",{"$f":"+C11+D11","v":232953},{"$f":"SUM(C12:C17)","v":220067},{"$f":"SUM(D12:D17)","v":12886},{"$f":"+F11+G11","v":10888},{"$f":"SUM(F12:F17)","v":10509},{"$f":"SUM(G12:G17)","v":379}]
["Primero",{"$f":"+C12+D12","v":38051},36053,1998,{"$f":"+F12+G12","v":5024},4862,162]
["Segundo",38263,36223,2040,2242,2171,71]
["Tercero",38639,36484,2155,1600,1540,60]
["Cuarto",38987,36821,2166,997,962,35]
["Quinto",39454,37200,2254,701,672,29]
["Sexto",39559,37286,2273,324,302,22]
[]
["Fuente: Procesamiento propio en base a datos proporcionados por el D.E.E .— C.E.I.P."]
["Notas:\n- No incluye datos correspondientes a JICI\n- No se presenta información para la Educación Primaria Privada porque no existen establecimientos privados en el área demográfica rural"]

{"sheet":"II-2.2.13","index":32,"n_rows":34,"n_cols":7,"rows_kept":34,"cut":false,"hidden":false,"merged":[[33,0,33,6],[0,5,1,6],[4,0,4,6],[5,0,9,0],[5,1,5,6],[6,1,6,3],[6,5,6,6],[7,1,9,1],[7,2,7,3],[7,4,9,4],[7,5,7,6],[8,2,9,2],[8,3,9,3],[8,5,9,5],[8,6,9,6],[32,0,32,6]]}
["CONSEJO DE EDUCACIÓN PRIMARIA",null,null,null,null,"RENDIMIENTO ESCOLAR"]
[]
["Cuadro Nº II-2.2.13"]
[]
["RENDIMIENTO ESCOLAR EN EDUCACIÓN PRIMARIA COMÚN PÚBLICA POR  ÁREA DEMOGRÁFICA SEGÚN DEPARTAMENTO (Todo el país, 2017)"]
["DEPARTAMENTO","RENDIMIENTO ESCOLAR"]
[null,"PROMOVIDOS",null,null,null,"NO PROMOVIDOS"]
[null,"TOTAL","ÁREA DEMOGRÁFICA",null,"TOTAL","ÁREA DEMOGRÁFICA"]
[null,null,"Urbana","Rural",null,"Urbana","Rural"]
[]
["TOTAL",{"$f":"+C11+D11","v":232953},{"$f":"SUM(C12:C13)","v":220067},{"$f":"SUM(D12:D13)","v":12886},{"$f":"+F11+G11","v":10888},{"$f":"SUM(F12:F13)","v":10509},{"$f":"SUM(G12:G13)","v":379}]
["MONTEVIDEO",{"$f":"+C12+D12","v":70999},70999,0,{"$f":"+F12+G12","v":5484},5484,0]
["RESTO DEL PAÍS",{"$f":"+C13+D13","v":161954},{"$f":"SUM(C14:C31)","v":149068},{"$f":"SUM(D14:D31)","v":12886},{"$f":"+F13+G13","v":5404},{"$f":"SUM(F14:F31)","v":5025},{"$f":"SUM(G14:G31)","v":379}]
["Artigas",{"$f":"+C14+D14","v":7189},6649,540,{"$f":"+F14+G14","v":46},41,5]
["Canelones",39502,37185,2317,2284,2192,92]
["Cerro Largo",7416,6701,715,181,167,14]
["Colonia",9841,8902,939,275,256,19]
["Durazno",4645,4246,399,8,7,1]
["Flores",1869,1694,175,11,11,0]
["Florida",5280,4578,702,174,154,20]
["Lavalleja",4034,3641,393,97,90,7]
["Maldonado",12050,11577,473,365,349,16]
["Paysandú",9810,9022,788,279,252,27]
["Río Negro",5060,4626,434,170,142,28]
["Rivera",9849,9084,765,201,178,23]
["Rocha",6194,5928,266,119,115,4]
["Salto",11654,10566,1088,481,431,50]
["San José",9154,8029,1125,281,250,31]
["Soriano",7038,6487,551,246,226,20]
["Tacuarembó",7475,6549,926,136,117,19]
["Treinta y Tres",3894,3604,290,50,47,3]
["Fuente: Procesamiento propio en base a datos proporcionados por el D.E.E .— C.E.I.P."]
["Notas:  No incluye datos correspondientes a JICI"]
["           No se presenta información para la Educación Primaria Privada porque no existen establecimientos privados en el área demográfica rural"]

{"sheet":"II-2.2.14","index":33,"n_rows":32,"n_cols":7,"rows_kept":32,"cut":false,"hidden":false,"merged":[[31,0,31,6],[0,5,1,6],[4,0,4,6],[5,0,8,0],[5,1,5,6],[6,1,6,3],[6,4,6,6],[7,2,7,3],[7,5,7,6]]}
["CONSEJO DE EDUCACIÓN PRIMARIA",null,null,null,null,"RENDIMIENTOS ESCOLAR"]
[]
["Cuadro Nº II-2.2.14"]
[]
["RENDIMIENTO ESCOLAR EN EDUCACIÓN PRIMARIA COMÚN PÚBLICA POR SEXO SEGÚN DEPARTAMENTO (Todo el país, 2017)"]
["DEPARTAMENTO","RENDIMIENTO ESCOLAR"]
[null,"PROMOVIDOS",null,null,"NO PROMOVIDOS"]
[null,"TOTAL","SEXO",null,"TOTAL","SEXO"]
[null,null,"Varón","Mujer",null,"Varón","Mujer"]
["TOTAL",{"$f":"+C10+D10","v":232953},{"$f":"SUM(C11:C12)","v":118641},{"$f":"SUM(D11:D12)","v":114312},{"$f":"+F10+G10","v":10888},{"$f":"SUM(F11:F12)","v":6647},{"$f":"SUM(G11:G12)","v":4241}]
["MONTEVIDEO",{"$f":"+C11+D11","v":70999},36284,34715,{"$f":"+F11+G11","v":5484},3256,2228]
["RESTO DEL PAÍS",161954,{"$f":"SUM(C13:C30)","v":82357},{"$f":"SUM(D13:D30)","v":79597},5404,{"$f":"SUM(F13:F30)","v":3391},{"$f":"SUM(G13:G30)","v":2013}]
["Artigas",7189,3749,3440,46,29,17]
["Canelones",39502,20013,19489,2284,1403,881]
["Cerro Largo",7416,3835,3581,181,119,62]
["Colonia",9841,4969,4872,275,165,110]
["Durazno",4645,2394,2251,8,6,2]
["Flores",1869,920,949,11,9,2]
["Florida",5280,2710,2570,174,110,64]
["Lavalleja",4034,2016,2018,97,63,34]
["Maldonado",12050,6019,6031,365,211,154]
["Paysandú",9810,4957,4853,279,182,97]
["Río Negro",5060,2545,2515,170,115,55]
["Rivera",9849,5043,4806,201,137,64]
["Rocha",6194,3150,3044,119,82,37]
["Salto",11654,5978,5676,481,300,181]
["San José",9154,4673,4481,281,178,103]
["Soriano",7038,3605,3433,246,159,87]
["Tacuarembó",7475,3769,3706,136,88,48]
["Treinta y Tres",3894,2012,1882,50,35,15]
["Fuente: Procesamiento propio en base a datos proporcionados por el D.E.E. — C.E.I.P."]
["Nota: No incluye datos correspondientes a JICI ."]

{"sheet":"II-2.2.15","index":34,"n_rows":31,"n_cols":7,"rows_kept":31,"cut":false,"hidden":false,"merged":[[0,5,1,6],[4,0,4,6],[5,0,8,0],[5,1,5,6],[6,1,6,3],[6,4,6,6],[7,1,8,1],[7,2,7,3],[7,4,8,4],[7,5,7,6]]}
["CONSEJO DE EDUCACIÓN PRIMARIA",null,null,null,null,"RENDIMIENTO ESCOLAR"]
[]
["Cuadro Nº II-2.2.15"]
[]
["RENDIMIENTO ESCOLAR EN EDUCACIÓN PRIMARIA COMÚN PRIVADA POR SEXO SEGÚN DEPARTAMENTO (Todo el país, 2017)"]
["DEPARTAMENTO","RENDIMIENTO ESCOLAR"]
[null,"PROMOVIDOS",null,null,"NO PROMOVIDOS"]
[null,"TOTAL","SEXO",null,"TOTAL","SEXO"]
[null,null,"V","M",null,"V","M"]
["TOTAL",{"$f":"+C10+D10","v":51337},{"$f":"SUM(C11:C12)","v":26149.000000000007},{"$f":"SUM(D11:D12)","v":25187.999999999996},{"$f":"+F10+G10","v":495.99999999999989},{"$f":"SUM(F11:F12)","v":298.99999999999994},{"$f":"SUM(G11:G12)","v":196.99999999999997}]
["MONTEVIDEO",{"$f":"+C11+D11","v":31618},16086.000000000005,15531.999999999996,{"$f":"+F11+G11","v":341.99999999999989},196.99999999999994,144.99999999999997]
["RESTO DEL PAÍS",19719,{"$f":"SUM(C13:C30)","v":10063},{"$f":"SUM(D13:D30)","v":9656},154,{"$f":"SUM(F13:F30)","v":102},{"$f":"SUM(G13:G30)","v":52.000000000000007}]
["Artigas",185,106,79,0,0,0]
["Canelones",7538,3860.0000000000005,3678,80,54,26.000000000000004]
["Cerro Largo",610,301,309,5,5,0]
["Colonia",742,375,367,0.99999999999999989,0.99999999999999989,0]
["Durazno",549,274,275,1,1,0]
["Flores",244,117,127,8,4,4]
["Florida",246,128,118,2,2,0]
["Lavalleja",553,275,278,2,2,0]
["Maldonado",3352.0000000000005,1736,1616.0000000000005,24,16,8.0000000000000018]
["Paysandú",1124,570,554,4.0000000000000009,2.0000000000000004,2.0000000000000004]
["Río Negro",486,273,213.00000000000003,6,4,2]
["Rivera",561,269,292,6.0000000000000018,4.0000000000000009,2.0000000000000004]
["Rocha",281,143,138,2,1,1]
["Salto",1158,591,567,5,3,2.0000000000000004]
["San José",735,354,381,3.0000000000000004,2.0000000000000004,1]
["Soriano",452,247,205,3,0,3]
["Tacuarembó",711,344,367,2.0000000000000004,1.0000000000000002,1.0000000000000002]
["Treinta y Tres",192,100,92,0,0,0]
["Fuente: Procesamiento propio en base a datos proporcionados por el D.E.E. — C.E.I.P."]

{"sheet":"II-2.2.16","index":35,"n_rows":35,"n_cols":5,"rows_kept":35,"cut":false,"hidden":false,"merged":[[32,0,32,3],[0,4,1,5],[6,0,9,0],[6,2,7,3],[7,1,9,1],[8,2,9,2],[8,3,9,3],[4,0,5,3]]}
["CONSEJO DE EDUCACIÓN PRIMARIA",null,null,null,"RENDIMIENTO ESCOLAR"]
[]
["Cuadro Nº II-2.2.16"]
[]
["ESTUDIANTES MATRICULADOS EGRESADOS DE EDUCACIÓN PRIMARIA COMÚN PÚBLICA POR ÁREA DEMOGRÁFICA SEGÚN DEPARTAMENTO (Todo el país, 2017)"]
[]
["DEPARTAMENTO",null,"ÁREA DEMOGRÁFICA"]
[null,"TOTAL"]
[null,null,"Urbana","Rural"]
[]
["TOTAL",{"$f":"+C11+D11","v":39559},{"$f":"SUM(C12:C13)","v":37286},{"$f":"SUM(D12:D13)","v":2273}]
["MONTEVIDEO",{"$f":"C12+D12","v":11744},11744,0]
["RESTO DEL PAÍS",{"$f":"+C13+D13","v":27815},{"$f":"SUM(C14:C31)","v":25542},{"$f":"SUM(D14:D31)","v":2273}]
["Artigas",{"$f":"+C14+D14","v":1224},1115,109]
["Canelones",6824,6405,419]
["Cerro Largo",1307,1167,140]
["Colonia",1704,1535,169]
["Durazno",796,719,77]
["Flores",315,283,32]
["Florida",921,812,109]
["Lavalleja",742,666,76]
["Maldonado",2118,2034,84]
["Paysandú",1712,1570,142]
["Río Negro",815,752,63]
["Rivera",1655,1523,132]
["Rocha",1019,976,43]
["Salto",1952,1772,180]
["San José",1537,1341,196]
["Soriano",1207,1117,90]
["Tacuarembó",1294,1128,166]
["Treinta y Tres",673,627,46]
["Fuente: Procesamiento propio en base a datos proporcionados por el D.E.E .— C.E.I.P."]
["Nota: No se presenta información para Montevideo Rural por que no existen establecimientos en  el área demográfica rural."]
["        "]
["        "]

{"sheet":"II-2.2.17","index":36,"n_rows":30,"n_cols":9,"rows_kept":30,"cut":false,"hidden":false,"merged":[[0,6,1,8],[4,0,4,8],[5,0,7,0],[5,1,7,1],[5,2,5,5],[5,6,5,8],[6,2,7,2],[6,3,6,5],[6,6,7,6],[6,7,6,8]]}
["CONSEJO DE EDUCACIÓN PRIMARIA",null,null,null,null,null,"RENDIMIENTO ESCOLAR"]
[]
["Cuadro Nº II-2.2.17"]
[]
["ESTUDIANTES MATRICULADOS EGRESADOS DE EDUCACIÓN PRIMARIA COMÚN POR FORMA DE ADMINISTRACIÓN SEGÚN DEPARTAMENTO (Todo el país, 2017)"]
["DEPARTAMENTO","TOTAL","PÚBLICA",null,null,null,"PRIVADA"]
[null,null,"Total","SEXO",null,null,"Total","SEXO"]
[null,null,null,"M","Varón","Mujer",null,"Varón","Mujer"]
["TOTAL",{"$f":"+C9+G9","v":47967},{"$f":"+E9+F9","v":39559},null,{"$f":"SUM(E10:E11)","v":20268},{"$f":"SUM(F10:F11)","v":19291},{"$f":"+H9+I9","v":8408},{"$f":"SUM(H10,H11)","v":4285},{"$f":"SUM(I10,I11)","v":4123}]
["MONTEVIDEO",{"$f":"+C10+G10","v":16938},{"$f":"+E10+F10","v":11744},6560,6073,5671,{"$f":"+H10+I10","v":5194},2657.0000000000005,2537]
["RESTO DEL PAÍS",{"$f":"+C11+G11","v":31029},27815,null,{"$f":"SUM(E12:E29)","v":14195},{"$f":"SUM(F12:F29)","v":13620},3214,{"$f":"SUM(H12:H29)","v":1628},{"$f":"SUM(I12:I29)","v":1586}]
["Artigas",{"$f":"+C12+G12","v":1249},1224,765,636,588,25,17,8]
["Canelones",8047,6824,3826,3420,3404,1223,612.99999999999989,610.00000000000011]
["Cerro Largo",1404,1307,802,660,647,97,43,54]
["Colonia",1825,1704,891,851,853,121,62,59]
["Durazno",876,796,502,386,410,80,41,39]
["Flores",367,315,192,159,156,52,23,29]
["Florida",958,921,502,479,442,37,21,16]
["Lavalleja",844,742,426,387,355,102,58.999999999999993,43]
["Maldonado",2700,2118,1183,1083,1035,582,305,276.99999999999994]
["Paysandú",1879,1712,976,872,840,167,85,82]
["Río Negro",889,815,501,441,374,74,44,30]
["Rivera",1739,1655,995,874,781,84,38,46.000000000000007]
["Rocha",1065,1019,603,513,506,46,22,24]
["Salto",2169,1952,1191,1004,948,217,100,117]
["San José",1641,1537,824,798,739,104,46,58.000000000000007]
["Soriano",1280,1207,717,611,596,73,40,33]
["Tacuarembó",1396,1294,845,679,615,102,55,47]
["Treinta y Tres",701,673,443,342,331,28,14,14]
["Fuente: Procesamiento propio en base a datos proporcionados por el D.E.E. — C.E.I.P."]

{"sheet":"II-2.2.18","index":37,"n_rows":34,"n_cols":5,"rows_kept":34,"cut":false,"hidden":false,"merged":[[30,0,30,4],[0,3,1,4],[4,0,4,4],[5,0,6,0],[5,1,5,2],[5,3,5,4],[29,0,29,4]]}
["CONSEJO DE EDUCACIÓN PRIMARIA",null,null,"RENDIMIENTO ESCOLAR"]
[]
["Cuadro Nº II-2.2.18"]
[]
["ASISTENCIA INSUFICIENTE Y ABANDONO INTERMITENTE DE 1º GRADO Y 1º A 6º GRADO EN EDUCACIÓN COMÚN PÚBLICA SEGÚN DEPARTAMENTO (Todo el país, 2017)"]
["DEPARTAMENTO","ASISTENCIA INSUFICIENTE",null,"ABANDONO INTERMITENTE"]
[null,"Sólo\n1.er año","1.º a 6.º  años","Sólo\n1.er año","1.º a 6.º  años"]
["TOTAL",{"$f":"SUM(B9:B10)","v":7388},{"$f":"SUM(C9:C10)","v":30741},{"$f":"SUM(D9:D10)","v":338},{"$f":"SUM(E9:E10)","v":1251}]
["MONTEVIDEO",3490,14286,189,655]
["RESTO DEL PAÍS",{"$f":"SUM(B11:B28)","v":3898},{"$f":"SUM(C11:C28)","v":16455},{"$f":"SUM(D11:D28)","v":149},{"$f":"SUM(E11:E28)","v":596}]
["Artigas",231,1044,3,25]
["Canelones",1314,5407,64,250]
["Cerro Largo",163,649,5,13]
["Colonia",105,444,6,22]
["Durazno",83,432,2,6]
["Flores",24,106,2,3]
["Florida",77,335,1,12]
["Lavalleja",52,282,1,15]
["Maldonado",315,1327,12,49]
["Paysandú",245,978,5,20]
["Río Negro",91,392,6,11]
["Rivera",239,1063,11,36]
["Rocha",134,513,8,23]
["Salto",367,1546,11,48]
["San José",167,718,5,25]
["Soriano",133,622,1,12]
["Tacuarembó",110,392,5,18]
["Treinta y Tres",48,205,1,8]
["Fuente: Procesamiento propio en base a datos proporcionados por el D.E.E. — C.E.I.P."]
["Nota: No incluye datos correspondientes a JICI ."]
[]
[]
[]
["       "]

{"sheet":"II-2.3.1 ","index":38,"n_rows":96,"n_cols":9,"rows_kept":96,"cut":false,"hidden":false,"merged":[[6,7,7,7],[6,8,7,8],[31,0,31,8],[32,0,32,8],[0,6,1,7],[4,0,4,8],[5,0,7,0],[5,2,5,8],[6,1,7,1],[6,2,7,2],[6,3,7,3],[6,4,7,4],[6,5,7,5],[6,6,7,6]]}
["CONSEJO DE EDUCACIÓN PRIMARIA",null,null,null,null,null,"PERSONAL DOCENTE"]
[]
["Cuadro Nº II-2.3.1"]
[]
["PERSONAL DOCENTE DE EDUCACIÓN PRIMARIA PÚBLICA POR TIPO DE DESEMPEÑO DOCENTE SEGÚN DEPARTAMENTO (Todo el país, 2017)"]
["DEPARTAMENTO",null,"TIPO DE DESEMPEÑO DOCENTE"]
[null,"TOTAL","Inspección","Educación Común","Educación en Colonias","Educación Especial","Servicios Docentes Especiales","Profesores Especiales","Coordinación Apoyo"]
[]
["TOTAL",{"$f":"SUM(B11:B12)","v":19861},284,15167,41,988,207,3077,97]
[]
["MONTEVIDEO",{"$f":"SUM(C11:I11)","v":5805},103,4150,15,393,158,970,16]
["RESTO DEL PAÍS",{"$f":"SUM(B14:B31)","v":14056},181,11017,26,595,{"$f":"SUM(G14:G31)","v":49},2107,81]
[]
["Artigas",{"$f":"SUM(C14:I14)","v":671},7,513,0,23,0,124,4]
["Canelones",2863,35,2304,6,123,12,370,13]
["Cerro Largo",733,11,559,0,33,4,122,4]
["Colonia",839,11,667,0,39,3,115,4]
["Durazno",470,7,373,0,21,0,65,4]
["Flores",215,4,159,0,9,0,40,3]
["Florida",546,7,409,1,28,3,94,4]
["Lavalleja",433,6,329,0,21,4,69,4]
["Maldonado",878,12,677,8,42,8,127,4]
["Paysandú",852,10,690,0,39,4,104,5]
["Río Negro",471,7,362,0,22,0,76,4]
["Rivera",891,11,671,0,30,1,174,4]
["Rocha",551,7,414,1,31,1,93,4]
["Salto",959,12,752,8,38,2,142,5]
["San José",775,8,632,1,30,0,100,4]
["Soriano",660,9,526,0,28,2,91,4]
["Tacuarembó",823,11,652,1,23,4,129,3]
["Treinta y Tres",426,6,328,0,15,1,72,4]
["Fuente: DEE — CEIP Listado de cargos de la División Hacienda a Julio 2016"]
[]
["        "]
["        "]
[]
[]
[]
[]
[]
[]
[]
[]
[]
[]
[]
[]
[]
[]
[]
[]
[]
[]
[]
[]
[]
[]
[]
[]
[]
[]
[]
[]
[]
[]
[]
[]
[]
[]
[]
[]
[]
[]
[{"$f":"SUM(A76:A77)","v":147}]
[]
[92]
[{"$f":"SUM(A79:A96)","v":55}]
[]
[0]
[14]
[4]
[3]
[0]
[0]
[5]
[4]
[7]
[5]
[0]
[1]
[3]
[2]
[0]
[2]
[5]
[0]

{"sheet":"II-2.3.2 ","index":39,"n_rows":32,"n_cols":12,"rows_kept":32,"cut":false,"hidden":false,"merged":[[52,20,53,20],[52,21,53,21],[52,22,53,22],[49,17,49,22],[50,11,53,12],[50,13,50,22],[51,13,51,15],[51,17,53,17],[51,18,51,22],[52,13,52,14],[52,15,53,15],[52,18,53,18],[52,19,53,19],[48,20,48,22],[6,11,8,12],[6,13,6,22],[7,5,8,5],[7,6,8,6],[7,7,8,7],[7,8,8,8],[7,9,8,9],[7,10,8,10],[7,13,7,16],[7,17,8,17],[7,18,7,22],[8,13,8,14],[30,0,30,10],[42,11,42,22],[45,11,45,22],[0,9,1,10],[4,0,4,10],[5,0,8,1],[5,2,8,2],[5,3,8,3],[5,4,8,4],[5,5,5,10],[6,5,6,7],[6,8,6,10]]}
["CONSEJO DE EDUCACIÓN PRIMARIA",null,null,null,null,null,null,null,null,"PERSONAL DOCENTE"]
[]
["Cuadro Nº II-2.3.2"]
[]
["PERSONAL DOCENTE DE EDUCACIÓN PRIMARIA PRIVADA POR TIPO DE ESTABLECIMIENTO Y TIPO DE DESEMPEÑO DOCENTE SEGÚN DEPARTAMENTO (Todo el país, 2017)"]
["  DEPARTAMENTO",null,"TOTAL","MAESTROS","PROFESORES","ESTABLECIMIENTOS"]
[null,null,null,null,null,"HABILITADOS",null,null,"AUTORIZADOS"]
[null,null,null,null,null,"Total","Maestros","Profesores","Total","Maestros","Profesores"]
[]
["TOTAL",null,{"$f":"+D10+E10","v":7755},{"$f":"+G10+J10","v":2679},{"$f":"+H10+K10","v":5076},{"$f":"+G10+H10","v":7287},{"$f":"SUM(G11:G12)","v":2552},{"$f":"SUM(H11:H12)","v":4735},{"$f":"+J10+K10","v":468},{"$f":"SUM(J11:J12)","v":127},{"$f":"SUM(K11:K12)","v":341}]
["MONTEVIDEO",null,{"$f":"+D11+E11","v":4679},{"$f":"G11+J11","v":1547},{"$f":"H11+K11","v":3132},{"$f":"+G11+H11","v":4269},1440,2829,{"$f":"+J11+K11","v":410},107,303]
["RESTO DEL PAÍS",null,{"$f":"+D12+E12","v":3076},{"$f":"G12+J12","v":1132},{"$f":"H12+K12","v":1944},{"$f":"+G12+H12","v":3018},{"$f":"SUM(G13:G30)","v":1112},{"$f":"SUM(H13:H30)","v":1906},{"$f":"+J12+K12","v":58},{"$f":"SUM(J13:J30)","v":20},{"$f":"SUM(K13:K30)","v":38}]
["Artigas",null,{"$f":"+F13+I13","v":45},12,33,{"$f":"+G13+H13","v":45},12,33,0,0,0]
["Canelones",null,1053,422,631,1004,406,598,49,16,33]
["Cerro Largo",null,80,33,47,80,33,47,0,0,0]
["Colonia",null,161,48,113,161,48,113,0,0,0]
["Durazno",null,70,30,40,70,30,40,0,0,0]
["Flores",null,52,20,32,52,20,32,0,0,0]
["Florida",null,43,16,27,43,16,27,0,0,0]
["Lavalleja",null,86,36,50,86,36,50,0,0,0," "]
["Maldonado",null,482,185,297,482,185,297,0,0,0]
["Paysandú",null,177,61,116,177,61,116,0,0,0]
["Río Negro",null,111,32,79,104,28,76,7,4,3]
["Rivera",null,98,35,63,98,35,63,0,0,0]
["Rocha",null,64,22,42,64,22,42,0,0,0]
["Salto",null,148,52,96,148,52,96,0,0,0]
["San José",null,124,42,82,122,42,80,2,0,2]
["Soriano",null,94,30,64,94,30,64,0,0,0]
["Tacuarembó",null,166,47,119,166,47,119,0,0,0]
["Treinta y Tres",null,22,9,13,22,9,13,0,0,0]
["Fuente: DEE — CEIP Planillas enviadas por las Inspecciones Departamentales a abril de 2011."]
["NOTA: El personal docente incluye exclusivamente docencia directa "]

{"sheet":"MEDIA BASICA ","index":40,"n_rows":118,"n_cols":2,"rows_kept":118,"cut":false,"hidden":false,"merged":[]}
[]
[]
[]
[]
[]
["Cuadro Nº II-3.1.1","ESTABLECIMIENTOS DE EDUCACIÓN MEDIA BÁSICA POR MODALIDAD Y FORMA DE ADMINISTRACIÓN SEGÚN DEPARTAMENTO. (Todo el país, 2017)."]
[""]
["Cuadro Nº II-3.1.2","ESTABLECIMIENTOS FÍSICOS DE EDUCACIÓN MEDIA POR FORMA DE ADMINISTRACIÓN SEGÚN DEPARTAMENTO.  (Todo el país, 2017)."]
[""]
[""]
["Cuadro Nº II-3.2.1","ESTUDIANTES MATRICULADOS EN EDUCACION MEDIA BÁSICA GENERAL POR GRADO SEGÚN GRANDES ÁREAS Y FORMA DE ADMINISTRACIÓN. (Todo el país, 2017). "]
[""]
["Cuadro Nº II-3.2.2","ESTUDIANTES MATRICULADOS EN EL CETP EN EDUCACIÓN MEDIA BÁSICA TECNOLÓGICA POR TIPO DE CURSO SEGÚN  GRANDES ÁREAS, DEPARTAMENTO Y SEXO.  (Todo el país, 2017). "]
[""]
["Cuadro Nº II-3.2.3","ESTUDIANTES MATRICULADOS EN SÉPTIMO, OCTAVO Y NOVENO GRADO DE CICLO BÁSICO RURAL POR SEXO SEGÚN DEPARTAMENTO.  (Todo el país, 2017). "]
[""]
["Cuadro Nº II-3.2.4","ESTUDIANTES MATRICULADOS DE EDUCACIÓN MEDIA BÁSICA GENERAL  POR GRADO Y FORMA DE ADMINISTRACIÓN SEGÚN DEPARTAMENTO.  (Todo el país, 2017)."]
[""]
["Cuadro Nº II-3.2.5","ESTUDIANTES MATRICULADOS DE EDUCACIÓN MEDIA BÁSICA PRIVADA  POR GRADO Y SEXO SEGÚN DEPARTAMENTO.  (Todo el país, 2017)."]
[""]
["Cuadro Nº II-3.2.6","ESTUDIANTES MATRICULADOS DE EDUCACIÓN MEDIA BÁSICA PÚBLICA  POR GRADO Y SEXO SEGÚN DEPARTAMENTO.  (Todo el país, 2017)."]
[""]
["Cuadro Nº II-3.2.7","ESTUDIANTES MATRICULADOS EN EDUCACIÓN TÉCNICA MEDIA BÁSICA POR TIPO DE CURSO SEGÚN EDAD.  (Todo el país, 2017)."]
[""]
["Cuadro Nº II-3.2.8"," ESTUDIANTES MATRICULADOS EN EL CETP EN EDUCACIÓN MEDIA BÁSICA POR TIPO DE CURSO SEGÚN SECTORES DE ESTUDIO.  (Todo el país, 2017)."]
[""]
[""]
["Cuadro Nº II-3.3.1","PERSONAL DOCENTE Y HORAS DOCENTES DEL CES EN EDUCACIÓN MEDIA BÁSICA GENERAL POR TITULACIÓN SEGÚN ASIGNATURAS.  (Todo el país, 2017). "]
[""]
["Cuadro Nº II-3.3.2","PERSONAL DOCENTE DEL CETP EN EDUCACIÓN MEDIA BÁSICA TECNOLÓGICA POR TIPO DE CURSO.  (Todo el país, 2017). "]
[]
[""]
["Cuadro Nº II-3.4.1","GRUPOS DEL CES EN EDUCACIÓN MEDIA BÁSICA GENERAL  COMPARADOS CON EL TOTAL DE GRUPOS EN EDUCACIÓN MEDIA GENERAL SEGÚN GRANDES ÁREAS Y FORMA DE ADMINISTRACIÓN.  (Todo el país, 2017). "]
[""]
[""]
[""]
[""]
[""]
[""]
[""]
[""]
[""]
[""]
[""]
[""]
[""]
[""]
[""]
[""]
[""]
[""]
[""]
[""]
[""]
[""]
[""]
[""]
[""]
[""]
[""]
[""]
[""]
[""]
[""]
[""]
[""]
[""]
[""]
[""]
[""]
[""]
[""]
[""]
[""]
[""]
[""]
[""]
[""]
[""]
[""]
[""]
[""]
[""]
[""]
[""]
[""]
[""]
[""]
[""]
[""]
[{"$f":"MID(B63,1,20)","v":""}]
[""]
[""]
[""]
[""]
[""]
[""]
[""]
[""]
[{"$f":"MID(B72,1,20)","v":""}]
[""]
[""]
[""]
[""]
[""]
[""]
[""]
[""]
[""]
[""]
[""]
[""]
[""]
[""]
[""]
[""]
[""]
[""]

{"sheet":"II-3.1.1 ","index":41,"n_rows":38,"n_cols":14,"rows_kept":38,"cut":false,"hidden":false,"merged":[[11,5,13,6],[37,0,42,10],[0,9,2,10],[5,0,5,10],[6,0,14,0],[6,3,6,13],[7,1,14,1],[7,2,14,2],[7,3,7,9],[7,12,7,13],[8,3,8,13],[9,3,10,6],[10,12,13,13],[9,7,14,7],[9,8,13,9],[9,10,14,10],[9,11,14,11],[11,3,13,4]]}
["CONSEJO DE EDUCACIÓN INICIAL Y PRIMARIA (CEIP), ",null,null,null,null,null,null,null,null,"ESTABLECIMIENTOS"]
["CONSEJO DE EDUCACIÓN SECUNDARIA (CES) Y CONSEJO DE EDUCACIÓN TÉCNICO PROFESIONAL (UTU)"]
[]
["Cuadro Nº II-3.1.1"]
[]
["ESTABLECIMIENTOS DE EDUCACIÓN MEDIA BÁSICA POR MODALIDAD Y FORMA DE ADMINISTRACIÓN SEGÚN DEPARTAMENTO                                 (Todo el país, 2017)"]
["DEPARTAMENTO",null,null,"MODALIDAD"]
[null,"TOTAL GENERAL","TOTAL LICEOS PÚBLICOS","CES",null,null,null,null,null,null,"CEIP",null,"CETP"]
[null,null,null,"FORMA DE ADMINISTRACIÓN"]
[null,null,null,"LICEOS PÚBLICOS",null,null,null,"TOTAL LICEOS PRIVADOS","Liceos Privados",null,"Escuelas con Ciclo Básico Rural","TOTAL ESCUELAS DE CBT Y TÈCNICA"]
[null,null,null,null,null,null,null,null,null,null,null,null,"Escuelas de CBT y Técnica"]
[null,null,null,"Diurnos Oficiales",null,"Extra Edad Oficiales (Nocturno Y Diurno)"]
[]
[]
[null,null,null,"Ciclo Básico","C.Básico y Bachillerato","Ciclo Básico","C.Básico y Bachillerato",null,"Ciclo Básico","C.Básico y Bachillerato",null,null,"Escuelas de CBT y Técnica","Reparticiones"]
["TOTAL",{"$f":"C16+H16+K16+L16","v":792},{"$f":"SUM(C17,C18)","v":338},{"$f":"D17+D18","v":98},{"$f":"E17+E18","v":157},{"$f":"F17+F18","v":19},{"$f":"G17+G18","v":64},{"$f":"SUM(I16:J16)","v":179},{"$f":"I17+I18","v":28},{"$f":"J17+J18","v":151},{"$f":"K17+K18","v":56},{"$f":"M16+N16","v":219},{"$f":"M17+M18","v":112},{"$f":"N17+N18","v":107}]
["MONTEVIDEO",{"$f":"C17+H17+K17+L17","v":218},{"$f":"SUM(D17:G17)","v":75},42,13,4,16,{"$f":"SUM(I17:J17)","v":101},12,89,0,{"$f":"M17+N17","v":42},22,20]
["RESTO DEL PAÍS",{"$f":"C18+H18+K18+L18","v":574},{"$f":"SUM(C19:C36)","v":263},{"$f":"SUM(D19:D36)","v":56},{"$f":"SUM(E19:E36)","v":144},{"$f":"SUM(F19:F36)","v":15},{"$f":"SUM(G19:G36)","v":48},{"$f":"SUM(I18:J18)","v":78},{"$f":"SUM(I19:I36)","v":16},{"$f":"SUM(J19:J36)","v":62},{"$f":"SUM(K19:K36)","v":56},177,{"$f":"SUM(M19:M36)","v":90},{"$f":"SUM(N19:N36)","v":87}]
["Artigas",23,{"$f":"SUM(D19:G19)","v":11},3,7,0,1,{"$f":"SUM(I19:J19)","v":1},0,1,3,8,4,4]
["Canelones",132,64,12,31,6,15,{"$f":"SUM(I20:J20)","v":29},6,23,0,39,17,22]
["Cerro Largo",29,11,1,7,1,2,3,0,3,4,11,5,6]
["Colonia*",35,17,3,9,0,5,1,0,1,6,11,9,2]
["Durazno",20,9,2,5,1,1,2,0,2,1,8,3,5]
["Flores",11,4,1,2,0,1,2,0,2,1,4,2,2]
["Florida",27,12,2,9,0,1,6,4,2,2,7,1,6]
["Lavalleja",19,9,2,6,1,0,2,2,0,2,6,2,4]
["Maldonado",40,17,3,9,1,4,12,1,11,1,10,8,2]
["Paysandú",35,13,5,7,0,1,3,1,2,9,10,4,6]
["Río Negro",22,9,2,5,0,2,1,0,1,5,7,3,4]
["Rivera",33,14,4,7,1,2,4,0,4,4,11,5,6]
["Rocha",23,13,3,7,0,3,2,1,1,3,5,5,0]
["Salto",25,13,1,9,2,1,3,0,3,0,9,4,5]
["San José",29,13,2,6,1,4,2,0,2,7,7,6,1]
["Soriano",21,12,4,5,0,3,1,0,1,1,7,6,1]
["Tacuarembó",32,14,3,9,0,2,3,1,2,5,10,2,8]
["Treinta y Tres",18,8,3,4,1,0,1,0,1,2,7,4,3]
["Fuente: D.E.- C.E.S ."]
["Notas:\n1- Los establecimientos considerados en el Tipo de Educación Escuelas con Ciclo Básico Rural ya fueron considerados en los totales de establecimientos de Educación Primaria por lo cual, si bien se presentan en la columna  correspondiente, no participan en el “Total” del presente cuadro.\n2- En un mismo establecimiento de UTU coexisten  ofertas educativas de diferentes niveles. Los establecimientos que se consideraron en este cuadro son aquellos en los que se dictan cursos clasificados como de EDUCACIÓN MEDIA BÁSICA."]

{"sheet":"II-3.1.2 ","index":42,"n_rows":33,"n_cols":7,"rows_kept":33,"cut":false,"hidden":false,"merged":[[31,0,31,5],[32,0,32,5],[0,6,0,7],[4,0,4,5],[5,0,8,0],[5,2,5,5],[6,1,8,1],[6,2,6,3],[7,2,7,5]]}
["CONSEJO DE EDUCACIÓN INICIAL Y PRIMARIA (CEIP), ",null,null,null,null,null,"ESTABLECIMIENTOS"]
["CONSEJO DE EDUCACIÓN SECUNDARIA (CES) Y CONSEJO DE EDUCACIÓN TÉCNICO PROFESIONAL (UTU)"]
["Cuadro Nº II-3.1.2"]
[]
["ESTABLECIMIENTOS FÍSICOS DE EDUCACIÓN MEDIA POR FORMA DE ADMINISTRACIÓN SEGÚN DEPARTAMENTO (Todo el país, 2017)"]
["DEPARTAMENTO",null,"MODALIDAD"]
[null,"TOTAL GENERAL","CES",null,"CEIP","CETP"]
[]
[null,null,"LICEOS PÚBLICOS","LICEOS PRIVADOS","Escuelas con Ciclo Básico Rural","Escuelas de CBT y Técnica."]
["TOTAL",{"$f":"B11+B12","v":813},{"$f":"C11+C12","v":301},{"$f":"D11+D12","v":196},{"$f":"E11+E12","v":56},{"$f":"F11+F12","v":260}]
["MONTEVIDEO",{"$f":"SUM(C11:F11)","v":246},75,110,0,61]
["RESTO DEL PAÍS",{"$f":"SUM(C12:F12)","v":567},{"$f":"SUM(C13:C30)","v":226},{"$f":"SUM(D13:D30)","v":86},{"$f":"SUM(E13:E30)","v":56},{"$f":"SUM(F13:F30)","v":199}]
["Artigas",{"$f":"C13+D13+E13+F13","v":24},12,1,3,8]
["Canelones",123,51,30,0,42]
["Cerro Largo",26,8,3,4,11]
["Colonia",36,14,1,6,15]
["Durazno",20,8,2,1,9]
["Flores",10,3,2,1,4]
["Florida",24,12,2,2,8]
["Lavalleja",19,8,2,2,7]
["Maldonado",41,13,14,1,13]
["Paysandú",41,14,4,9,14]
["Río Negro",22,8,2,5,7]
["Rivera",35,13,6,4,12]
["Rocha",21,11,2,3,5]
["Salto",26,11,5,0,10]
["San José",27,9,3,7,8]
["Soriano",19,10,1,1,7]
["Tacuarembó",34,13,4,5,12]
["Treinta y Tres",19,8,2,2,7]
["Fuente: C.E.S  - CETP- CEIP"]
["Nota: 1- A diferencia del cuadro anterior II-3.1.1, el presente consolida la cantidad de establecimientos físicos con independencia del nivel educativo al cual son dirigidos los programas de estudios impartidos. En el caso del CETP debe considerarse que además de Educación Media se dictan programas dirigidos a Educación Terciaria No Universitaria y Educación de Jóvenes y Adultos. "]
["2- Dentro de la cantidad de establecimientos declarados por UTU en este apartado se encuentran 120 reparticiones (Montevideo=26; Resto del País=94). Son localizaciones en las cuales se imparten cursos administrados por el CETP-UTU. Estos locales no forman parte de los activos de ANEP. "]

{"sheet":"II-3.2.1 ","index":43,"n_rows":27,"n_cols":5,"rows_kept":27,"cut":false,"hidden":false,"merged":[[24,0,24,4],[0,3,1,5],[4,0,4,4],[5,0,7,0],[5,2,6,4],[6,1,7,1]]}
["CONSEJO DE EDUCACIÓN SECUNDARIA",null,null,"ESTUDIANTES MATRICULADOS"]
[]
["Cuadro Nº II-3.2.1"]
[]
["ESTUDIANTES MATRICULADOS EN EDUCACION MEDIA BÁSICA GENERAL POR GRADO SEGÚN GRANDES ÁREAS Y FORMA DE ADMINISTRACIÓN (Todo el país, 2017)"]
["GRANDES ÁREAS Y FORMA DE ADMINISTRACIÓN",null,"GRADO"]
[null,"TOTAL"]
[null,null,"PRIMERO","SEGUNDO","TERCERO"]
["TOTAL DEL PAÍS",{"$f":"C9+D9+E9","v":147808},{"$f":"C14+C19","v":50861},{"$f":"D14+D19","v":48155},48792]
["MEDIA BÁSICA PÚBLICA",{"$f":"C10+D10+E10","v":123292},42497,39817,40978]
["  Diurna",107463,38701,35393,33369]
["  Nocturna",15829,3796,4424,7609]
["MEDIA BÁSICA PRIVADA",24516,8364,8338,7814]
["TOTAL MONTEVIDEO",54674,{"$f":"C15+C18","v":18861},{"$f":"D15+D18","v":18070},{"$f":"E15+E18","v":17743}]
["MEDIA BÁSICA PÚBLICA",38291,{"$f":"C16+C17","v":13217},{"$f":"D16+D17","v":12479},{"$f":"E16+E17","v":12595}]
["  Diurna",32906,11995,10966,9945]
["  Nocturna",5385,1222,1513,2650]
["MEDIA BÁSICA PRIVADA",16383,5644,5591,5148]
["TOTAL RESTO DEL PAÍS",93134,{"$f":"C20+C23","v":32000},{"$f":"D20+D23","v":30085},{"$f":"E20+E23","v":31049}]
["MEDIA  BÁSICA PÚBLICA",85001,{"$f":"C21+C22","v":29280},{"$f":"D21+D22","v":27338},{"$f":"E21+E22","v":28383}]
["  Diurna",74557,26706,24427,23424]
["  Nocturna",10444,2574,2911,4959]
["MEDIA BÁSICA PRIVADA",8133,2720,2747,2666]
["Fuente: D.E. — C.E.S."]
["Nota: La referencia \"Privada\", (incluye los Habilitados \"Liceo Naval\" y \"Liceo Militar\"), se corresponde con la de \"Liceos Habilitados\" presente en ediciones anteriores del Anuario Estadístico del MEC."]
[]
["        "]

{"sheet":"II-3.2.2","index":44,"n_rows":35,"n_cols":20,"rows_kept":35,"cut":false,"hidden":false,"merged":[[9,17,12,17],[9,18,9,19],[10,18,10,19],[11,18,12,18],[11,19,12,19],[9,14,12,14],[9,15,9,16],[10,15,10,16],[11,15,12,15],[11,16,12,16],[10,12,10,13],[11,3,12,3],[11,4,12,4],[11,6,12,6],[11,7,12,7],[11,9,12,9],[11,10,12,10],[11,12,12,12],[11,13,12,13],[0,7,1,9],[5,0,6,8],[8,0,12,0],[8,1,12,1],[8,3,8,13],[9,2,12,2],[9,3,9,4],[9,5,12,5],[9,6,9,7],[9,8,12,8],[9,9,9,10],[9,11,12,11],[9,12,9,13],[10,3,10,4],[10,6,10,7],[10,9,10,10]]}
["CONSEJO DE EDUCACIÓN TÉCNICO PROFESIONAL (U.T.U.)",null,null,null,null,null,null,"ESTUDIANTES MATRICULADOS"]
[]
[]
[]
["Cuadro Nº II-3.2.2."]
["ESTUDIANTES MATRICULADOS EN EL CETP EN EDUCACIÓN MEDIA BÁSICA TECNOLÓGICA POR TIPO DE CURSO SEGÚN  GRANDES ÁREAS, DEPARTAMENTO Y SEXO (Todo el país, 2017)"]
[]
[]
["GRANDES ÁREAS,DEPARTAMENTO  Y SEXO ","TOTAL ",null,"EDUCACIÓN MEDIA BÁSICA TECNOLÓGICA "]
[null,null,"TOTAL ","Vinculación INTERCICLOS",null,"TOTAL","C. B. T. Agrario",null,"TOTAL","Ciclo Básico Tecnológico",null,"TOTAL ","Formación Profesional Básica 2007",null,"TOTAL ","Programa Rumbo",null,"TOTAL ","Programa Centros Educ.Comunitarios "]
[null,null,null,"Sexo",null,null,"Sexo",null,null,"Sexo",null,null,"Sexo",null,null,"Sexo",null,null,"Sexo"]
[null,null,null,"V","M",null,"V","M",null,"V","M",null,"V","M",null,"V","M",null,"V","M"]
[]
["TOTAL ",{"$f":"C14+F14+I14+L14+O14+R14","v":35907},{"$f":"SUM(C15:C16)","v":4},2,2,2040,{"$f":"G15+G16","v":1432},{"$f":"H15+H16","v":608},17359,10065,7294,14670,9164,5506,{"$f":"P14+Q14","v":1152},510,642,{"$f":"S14+T14","v":682},439,243]
["Montevideo",{"$f":"C15+F15+I15+L15+O15+R15","v":8348},{"$f":"+D15+E15","v":1},1,0,{"$f":"+G15+H15","v":151},107,44,{"$f":"+J15+K15","v":3349},1958,1391,{"$f":"+M15+N15","v":3949},2375,1574,{"$f":"P15+Q15","v":352},189,163,{"$f":"S15+T15","v":546},346,200]
["Resto del País ",27559,{"$f":"SUM(C17:C34)","v":3},1,2,1889,1325,564,14010,8107,5903,10721,6789,3932,{"$f":"P16+Q16","v":800},{"$f":"SUM(P17:P34)","v":321},{"$f":"SUM(Q17:Q34)","v":479},136,{"$f":"SUM(S17:S34)","v":93},{"$f":"SUM(T17:T34)","v":43}]
["Artigas",1364,{"$f":"+D17+E17","v":0},0,0,{"$f":"+G17+H17","v":70},47,23,{"$f":"+J17+K17","v":791},479,312,{"$f":"+M17+N17","v":447},223,224,56,23,33,0,0,0]
["Canelones",6329,0,0,0,71,48,23,2682,1547,1135,3313,1992,1321,263,84,179,0,0,0]
["Cerro Largo",1605,0,0,0,112,83,29,898,515,383,537,319,218,58,25,33,0,0,0]
["Colonia",1645,0,0,0,140,102,38,1053,586,467,427,300,127,25,10,15,0,0,0]
["Durazno",1264,0,0,0,142,85,57,781,451,330,341,216,125,0,0,0,0,0,0]
["Flores",322,0,0,0,0,0,0,164,93,71,158,105,53,0,0,0,0,0,0]
["Florida",744,0,0,0,0,0,0,304,177,127,404,251,153,36,21,15,0,0,0]
["Lavalleja",662,0,0,0,94,65,29,182,97,85,361,253,108,25,11,14,0,0,0]
["Maldonado",1907,0,0,0,72,44,28,1064,591,473,580,394,186,55,33,22,136,93,43]
["Paysandú",2033,1,1,0,359,234,125,861,529,332,751,528,223,61,29,32,0,0,0]
["Rio Negro",868,0,0,0,27,23,4,508,313,195,333,214,119,0,0,0,0,0,0]
["Rivera",1466,0,0,0,279,228,51,681,440,241,472,330,142,34,20,14,0,0,0]
["Rocha",830,0,0,0,40,30,10,413,216,197,352,237,115,25,8,17,0,0,0]
["Salto",1575,2,0,2,193,121,72,769,428,341,585,369,216,26,9,17,0,0,0]
["San José",1797,0,0,0,96,66,30,1221,697,524,426,274,152,54,20,34,0,0,0]
["Soriano",1494,0,0,0,105,86,19,869,490,379,464,305,159,56,18,38,0,0,0]
["Tacuarembó",1087,0,0,0,13,8,5,541,332,209,507,301,206,26,10,16,0,0,0]
["Treinta y Tres",567,0,0,0,76,55,21,228,126,102,263,178,85,0,0,0,0,0,0]
["Fuente: Procesamiento propio en base a datos proporcionados por el D.E. - CETP  (U.T.U) ."]

{"sheet":"II-3.2.3","index":45,"n_rows":36,"n_cols":13,"rows_kept":36,"cut":false,"hidden":false,"merged":[[0,8,1,13],[5,0,5,12],[6,0,11,0],[6,1,9,3],[6,4,6,12],[7,4,7,12],[8,4,8,6],[8,7,8,9],[8,10,8,12],[9,4,9,6],[10,1,11,1],[10,2,11,2],[10,3,11,3],[10,12,11,12],[9,7,9,9],[9,10,9,12],[10,4,11,4],[10,5,11,5],[10,9,11,9],[10,10,11,10],[10,11,11,11],[10,6,11,6],[10,7,11,7],[10,8,11,8]]}
["CONSEJO DE EDUCACIÓN PRIMARIA",null,null,null,null,null,null,null,"ESTUDIANTES MATRICULADOS"]
[]
["Cuadro Nº II-3.2.3"]
[]
[]
["ESTUDIANTES MATRICULADOS EN SÉPTIMO, OCTAVO Y NOVENO GRADO DE CICLO BÁSICO RURAL POR SEXO SEGÚN DEPARTAMENTO (Todo el país, 2017)"]
["DEPARTAMENTO","TOTAL",null,null,"CICLO BÁSICO RURAL"]
[null,null,null,null,"GRADO"]
[null,null,null,null,"SÉPTIMO",null,null,"OCTAVO",null,null,"NOVENO"]
[null,null,null,null,"SEXO",null,null,"SEXO",null,null,"SEXO"]
[null,"TOTAL","V","M","T","V","M","T","V","M","T","V","M"]
[]
["TOTAL",{"$f":"B14+B15","v":1470},{"$f":"F13+I13+L13","v":789},681,{"$f":"F13+G13","v":534},{"$f":"F14+F15","v":285},{"$f":"G14+G15","v":249},{"$f":"I13+J13","v":502},{"$f":"I14+I15","v":282},{"$f":"J14+J15","v":220},{"$f":"L13+M13","v":434},{"$f":"L14+L15","v":222},{"$f":"M14+M15","v":212}]
["MONTEVIDEO",0,0,0,{"$f":"F14+G14","v":0},0,0,{"$f":"I14+J14","v":0},0,0,{"$f":"L14+M14","v":0},0,0]
["RESTO DEL PAÍS",{"$f":"E15+H15+K15","v":1470},789,{"$f":"G15+J15+M15","v":681},{"$f":"F15+G15","v":534},{"$f":"SUM(F16:F33)","v":285},{"$f":"SUM(G16:G33)","v":249},{"$f":"I15+J15","v":502},{"$f":"SUM(I16:I33)","v":282},{"$f":"SUM(J16:J33)","v":220},{"$f":"L15+M15","v":434},{"$f":"SUM(L16:L33)","v":222},{"$f":"SUM(M16:M33)","v":212}]
["Artigas",98,49,49,{"$f":"F16+G16","v":36},17,19,37,22,15,25,10,15]
["Canelones",{"$f":"E17+H17+K17","v":0},{"$f":"F17+I17+L17","v":0},{"$f":"G17+J17+M17","v":0},0,0,0,0,0,0,0,0,0]
["Cerro Largo",105,58,47,42,25,17,41,21,20,22,12,10]
["Colonia",158,98,60,34,20,14,65,40,25,59,38,21]
["Durazno",23,13,10,7,5,2,13,7,6,3,1,2]
["Flores",17,9,8,7,4,3,5,3,2,5,2,3]
["Florida",44,32,26,25,14,11,19,12,7,null,6,8]
["Lavalleja",63,38,25,26,17,9,21,15,6,16,6,10]
["Maldonado",31,18,13,12,7,5,13,7,6,6,4,2]
["Paysandú",224,105,119,62,21,41,77,42,35,85,42,43]
["Río Negro",81,38,43,37,20,17,27,12,15,17,6,11]
["Rivera",90,40,50,34,16,18,26,11,15,30,13,17]
["Rocha",76,40,36,28,11,17,25,14,11,23,15,8]
["Salto",0,0,0,0,0,0,0,0,0,0,0,0]
["San José",229,123,106,97,49,48,67,41,26,65,33,32]
["Soriano",28,16,12,11,9,2,8,3,5,9,4,5]
["Tacuarembó",142,90,52,58,41,17,42,24,18,42,25,17]
["Treinta y Tres",47,22,25,18,9,9,16,8,8,13,5,8]
["Fuente: DE — CES"]
[]
["Nota: No se tienen datos por sexo"]

{"sheet":"II-3.2.4","index":46,"n_rows":32,"n_cols":7,"rows_kept":32,"cut":false,"hidden":false,"merged":[[0,3,1,6],[4,0,4,6],[6,0,9,0],[6,1,6,6],[7,1,7,2],[7,3,7,4],[7,5,7,6],[8,1,8,6]]}
["CONSEJO DE EDUCACIÓN SECUNDARIA",null,null,"ESTUDIANTES MATRICULADOS"]
[]
["Cuadro Nº II-3.2.4"]
[]
["ESTUDIANTES MATRICULADOS DE EDUCACIÓN MEDIA BÁSICA GENERAL  POR GRADO Y FORMA DE ADMINISTRACIÓN SEGÚN DEPARTAMENTO          (Todo el país, 2017)"]
[]
["DEPARTAMENTO","GRADO"]
[null,"PRIMERO",null,"SEGUNDO",null,"TERCERO"]
[null,"FORMA DE ADMINISTRACIÓN"]
[null,"Públicos","Privados","Públicos","Privados","Públicos","Privados"]
["TOTAL",{"$f":"B12+B13","v":42497},8364,39817,8338,{"$f":"F12+F13","v":40978},7814]
["MONTEVIDEO",13217,5644,12479,5591,12595,5148]
["RESTO DEL PAÍS",{"$f":"SUM(B14:B31)","v":29280},2720,27338,2747,28383,2666]
["Artigas",1035,20,1125,28,1186,17]
["Canelones",7596,1118,7123,1123,7451,1079]
["Cerro Largo",1238,109,1105,126,1197,129]
["Colonia",1607,32,1584,23,1641,18]
["Durazno",826,97,730,99,804,82]
["Flores",352,47,357,67,390,54]
["Florida",911,67,815,62,879,63]
["Lavalleja",856,54,799,38,756,38]
["Maldonado",2329,458,2299,403,2371,467]
["Paysandú",1439,192,1412,206,1424,176]
["Río Negro",746,21,731,11,786,10]
["Rivera",2031,77,1806,66,1777,63]
["Rocha",1202,60,1147,46,1163,44]
["Salto ",1835,128,1556,146,1800,138]
["San José",1545,47,1386,74,1404,96]
["Soriano",1409,70,1110,72,1128,65]
["Tacuarembó",1563,89,1492,115,1491,85]
["Treinta y Tres",760,34,761,42,735,42]
["Fuente: DE — CES"]

{"sheet":"II-3.2.5","index":47,"n_rows":32,"n_cols":7,"rows_kept":32,"cut":false,"hidden":false,"merged":[[3,0,3,6],[5,0,8,0],[5,1,5,6],[6,1,6,2],[6,3,6,4],[6,5,6,6],[7,1,7,6]]}
["CONSEJO DE EDUCACIÓN SECUNDARIA"]
["Cuadro Nº II-3.2.5"]
[]
["ESTUDIANTES MATRICULADOS DE EDUCACIÓN MEDIA BÁSICA PRIVADA  POR GRADO Y SEXO SEGÚN DEPARTAMENTO (Todo el país, 2017)"]
[]
["DEPARTAMENTO","GRADO"]
[null,"PRIMERO",null,"SEGUNDO",null,"TERCERO"]
[null,"SEXO"]
[null,"Mujer","Varón","Mujer","Varón","Mujer","Varón"]
["TOTAL",{"$f":"B11+B12","v":4108},4130,4115,4107,3832,3762]
["MONTEVIDEO",2773,2772,2758,2736,2510,2550]
["RESTO DEL PAÍS",{"$f":"SUM(B13:B30)","v":1335},1358,1357,1371,1322,1212]
["Artigas",9,11,15,13,9,8]
["Canelones",546,572,574,549,565,514]
["Cerro Largo",62,47,53,73,22,27]
["Colonia",16,16,9,14,8,10]
["Durazno",46,51,47,52,45,37]
["Flores",28,19,27,40,35,19]
["Florida",34,33,32,30,37,26]
["Lavalleja",11,16,10,9,7,12]
["Maldonado",231,227,191,212,231,236]
["Paysandú",92,100,99,107,85,91]
["Río Negro",13,8,2,9,5,5]
["Rivera",37,40,28,38,25,38]
["Rocha",30,30,26,20,26,18]
["Salto ",65,63,79,67,83,55]
["San José",27,20,41,33,39,27]
["Soriano",33,37,32,40,36,29]
["Tacuarembó",42,47,67,48,40,45]
["Treinta y Tres",13,21,25,17,24,15]
["Fuente: DE — CES"]
["Nota: Las diferencias con la matrícula de otros cuadros se debe a la ausencia de información sobre sexo en algunos colegios."]

{"sheet":"II-3.2.6","index":48,"n_rows":31,"n_cols":7,"rows_kept":31,"cut":false,"hidden":false,"merged":[[3,0,3,6],[5,0,8,0],[5,1,5,6],[6,1,6,2],[6,3,6,4],[6,5,6,6],[7,1,7,6]]}
["CONSEJO DE EDUCACIÓN SECUNDARIA"]
["Cuadro Nº II-3.2.6"]
[]
["ESTUDIANTES MATRICULADOS DE EDUCACIÓN MEDIA BÁSICA PÚBLICA  POR GRADO Y SEXO SEGÚN DEPARTAMENTO (Todo el país, 2017)"]
[]
["DEPARTAMENTO","GRADO"]
[null,"PRIMERO",null,"SEGUNDO",null,"TERCERO"]
[null,"SEXO"]
[null,"Mujer","Varón","Mujer","Varón","Mujer","Varón"]
["TOTAL",{"$f":"B11+B12","v":21323},21174,21052,18765,21792,19186]
["MONTEVIDEO",6560,6657,6593,5886,6595,6000]
["RESTO DEL PAÍS",{"$f":"SUM(B13:B30)","v":14763},{"$f":"SUM(C13:C30)","v":14517},14459,12879,15197,13186]
["Artigas",503,532,556,569,626,560]
["Canelones",3771,3825,3725,3398,3926,3525]
["Cerro Largo",691,547,587,518,642,555]
["Colonia",850,757,890,694,881,760]
["Durazno",456,370,390,340,451,353]
["Flores",186,166,215,142,227,163]
["Florida",464,447,418,397,467,412]
["Lavalleja",432,424,428,371,414,342]
["Maldonado",1153,1176,1207,1092,1189,1182]
["Paysandú",729,710,755,657,787,637]
["Río Negro",406,340,382,349,438,348]
["Rivera",999,1032,956,850,930,847]
["Rocha",593,609,612,535,604,559]
["Salto ",913,922,789,767,933,867]
["San José",760,785,751,635,807,597]
["Soriano",719,690,616,494,636,492]
["Tacuarembó",739,824,782,710,814,677]
["Treinta y Tres",399,361,400,361,425,310]
["Fuente: DE — CES"]

{"sheet":"II-3.2.7","index":49,"n_rows":21,"n_cols":8,"rows_kept":21,"cut":false,"hidden":false,"merged":[[20,0,20,4],[0,4,1,5],[4,0,4,3],[6,0,7,0],[6,1,7,1],[6,2,6,5]]}
["CONSEJO DE EDUCACIÓN TÉCNICO PROFESIONAL (U.T.U.)",null,null,null," MATRICULADOS"]
[]
["Cuadro Nº II-3.2.7"]
[]
["ESTUDIANTES MATRICULADOS EN EDUCACIÓN TÉCNICA MEDIA BÁSICA POR TIPO DE CURSO SEGÚN EDAD (Todo el país, 2017)"]
[]
["EDAD","TOTAL","TIPO DE CURSO"]
[null,null,"Articulación Educación Media Básica","C.T.B Agrario","Ciclo Básico Tecnológico","Formación Profesional Básica\nPlan 2007","Articulación Otras","Programas Centros educ. comunitarios "]
["TOTAL",{"$f":"C9+D9+E9+F9+G9+H9","v":35907},{"$f":"SUM(C10:C20)","v":4},2040,17359,14670,1152,682]
["11 y 12 años ",{"$f":"C10+D10+E10+F10+G10+H10","v":4977},0,470,3973,509,0,25]
["13 años ",6667,0,609,4926,1050,0,82]
["14 años ",7552,1,604,4913,1854,1,179]
["15 años ",5477,0,217,2196,2852,24,188]
["16 años ",4576,0,97,930,3365,38,146]
["17 años ",3132,1,31,324,2672,45,59]
["18 años ",1240,0,7,56,1078,97,2]
["19 años ",571,0,3,19,488,60,1]
["20 a 24 años ",787,0,2,20,518,247,0]
["25 a 29 años ",288,0,0,2,109,177,0]
["30 años y más ",640,2,0,0,175,463,0]
["Fuente : Procesamiento propio en base a datos proporcionados por el D.E.-CETP (U.T.U.) "]

{"sheet":"II-3.2.8 ","index":50,"n_rows":36,"n_cols":8,"rows_kept":36,"cut":false,"hidden":false,"merged":[[35,0,35,4],[0,2,1,3],[6,1,7,1],[6,2,6,7],[6,0,8,0],[5,0,5,7]]}
["CONSEJO DE EDUCACIÓN TÉCNICO PROFESIONAL (U.T.U.)",null,"MATRICULADOS"]
[]
[]
["Cuadro Nº II-3.2.8."]
[]
["ESTUDIANTES MATRICULADOS EN EL CETP EN EDUCACIÓN MEDIA BÁSICA POR TIPO DE CURSO SEGÚN SECTORES DE ESTUDIO                        (Todo el país, 2017)"]
["SECTORES DE ESTUDIO","TOTAL","TIPO DE CURSO"]
[null,null,"Vinculación INTERCICLOS","C. B. T. Agrario","Ciclo Básico Tecnológico","Formación Profesional Básica Plan 2007","Programa Rumbo","Programas Centros educ. Comuniotarios "]
[]
["Prog. Ciclo Básico. Educación Media",{"$f":"SUM(C10:H10)","v":35907},{"$f":"SUM(C11:C34)","v":4},{"$f":"SUM(D11:D34)","v":2040},17359,14670,1152,682]
["Agropecuario",{"$f":"SUM(C11:H11)","v":278},0,0,0,278,0,0]
["Artes Escénicas",396,0,0,0,396,0,0]
["Artes y artesanías",39,0,0,0,39,0,0]
["Comunicación",521,0,0,0,521,0,0]
["Construcción y Arquitectura",446,0,0,0,446,0,0]
["Deporte y afines",1595,0,0,0,1595,0,0]
["Electricidad y Electrónica",1589,0,0,0,1582,7,0]
["Gastronomía",2137,0,0,0,2126,11,0]
["Gráficos",73,0,0,0,73,0,0]
["Hipica",64,0,0,0,64,0,0]
["Hortifruticultura y Jardinería",194,0,0,0,194,0,0]
["Informática",1441,0,0,0,1441,0,0]
["Madera y Muebles",1261,0,0,0,1255,6,0]
["Mantenimiento y Rep. de Vehículos",1416,0,0,0,1416,0,0]
["Metal - Mecánica",642,0,0,0,625,17,0]
["Producción de Alimentos",479,0,0,0,479,0,0]
["Programa Articulación Rumbo y Otras",1386,0,0,0,281,1105,0]
["Programa C.B.T. Aula Tecnológica",4,4,0,0,0,0,0]
["Programa Ciclo Básico Agrario",2040,0,2040,0,0,0,0]
["Programa Educación Media Básica",17375,0,0,17359,0,0,16]
["Química, Termodinámica y Agroener.",72,0,0,0,72,0,0]
["Sector no especificado",666,0,0,0,0,0,666]
["Servicios Personales",1536,0,0,0,1536,0,0]
["Textil y Confección de Vestimenta",257,0,0,0,251,6,0]
[]
["Fuente : Procesamiento propio en base a datos proporcionados por el D.E.-CETP (U.T.U.) "]

{"sheet":"II-3.3.1 ","index":51,"n_rows":43,"n_cols":7,"rows_kept":43,"cut":false,"hidden":false,"merged":[[0,5,1,6],[4,0,4,6],[6,0,7,0],[6,1,7,1],[6,2,6,3],[6,4,7,4],[6,5,6,6]]}
["CONSEJO DE EDUCACIÓN SECUNDARIA",null,null,null,null,"PERSONAL DOCENTE"]
[]
["Cuadro Nº II-3.3.1."]
[]
["PERSONAL DOCENTE Y HORAS DOCENTES DEL CES EN EDUCACIÓN MEDIA BÁSICA GENERAL POR TITULACIÓN SEGÚN ASIGNATURAS (Todo el país, 2017)"]
[]
["ASIGNATURAS","TOTAL DOCENTES","PERSONAL DOCENTE",null,"TOTAL HORAS ","HORAS DOCENTES"]
[null,null,"Titulados","No Titulados",null,"Titulados","No Titulados"]
["TOTAL",{"$f":"SUM(C9:D9)","v":13198},{"$f":"SUM(C10:C39)","v":8104},{"$f":"SUM(D10:D39)","v":5094},{"$f":"SUM(F9:G9)","v":156154},{"$f":"SUM(F10:F39)","v":93966},{"$f":"SUM(G10:G39)","v":62188}]
["ACTIVIDADES ADAPTADAS AL MEDIO",{"$f":"SUM(C10:D10)","v":67},15,52,{"$f":"SUM(F10:G10)","v":618},87,531]
["ASTRONOMÍA",{"$f":"SUM(C11:D11)","v":0},0,0,{"$f":"SUM(F11:G11)","v":0},0,0]
["BIOLOGÍA",{"$f":"SUM(C12:D12)","v":1115},867,248,12162,9948,2214]
["CIENCIAS FÍSICAS",{"$f":"SUM(C13:D13)","v":838},442,396,8358,4614,3744]
["COMUNICACIÓN VISUAL - DIBUJO",686,451,235,8022,5454,2568]
["CONTABILIDAD",{"$f":"SUM(C15:D15)","v":0},0,0,{"$f":"SUM(F15:G15)","v":0},0,0]
["CURRÍCULO ABIERTO",571,246,325,{"$f":"SUM(F16:G16)","v":4922},1732,3190]
["ECONOMÍA",0,0,0,0,0,0]
["EDUCACIÓN FÍSICA",{"$f":"SUM(C18:D18)","v":967},924,43,11995,11087,908]
["EDUCACIÓN SOCIAL Y CÍVICA",{"$f":"SUM(C19:D19)","v":524},482,42,3660,3285,375]
["ESTUDIOS ECONÓMICOS",0,0,0,0,0,0]
["EXP.CORPORAL Y DANZA",0,0,0,0,0,0]
["EXP.CORPORAL Y TEATRO",0,0,0,0,0,0]
["FILOSOFÍA",0,0,0,0,0,0]
["FÍSICA",446,168,278,3570,1242,2328]
["GEOGRAFÍA",890,702,188,{"$f":"SUM(F25:G25)","v":10897},8744,2153]
["GEOLOGÍA",0,0,0,0,0,0]
["HISTORIA",1153,987,166,12192,10497,1695]
["IDIOMA ESPAÑOL",1115,807,308,16413,11931,4482]
["INFORMÁTICA",863,166,697,{"$f":"SUM(F29:G29)","v":11128},1764,9364]
["INGLÉS",1110,450,660,15996,7040,8956]
["ITALIANO",0,0,0,0,0,0]
["LENG.COMUNIC.Y MEDIOS AUDIOV.",0,0,0,0,0,0]
["LENGUAJE DE SEÑAS",2,2,0,20,20,0]
["LITERATURA",533,420,113,4864,3876,988]
["MATEMATICA",1240,480,760,{"$f":"SUM(F35:G35)","v":19865},8001,11864]
["MÚSICA",557,160,397,7884,2130,5754]
["QUÍMICA",521,335,186,{"$f":"SUM(F37:G37)","v":3588},2514,1074]
["REC.NATURALES Y PAIS.AGRARIO",0,0,0,0,0,0]
["TEATRO",0,0,0,{"$f":"SUM(F39:G39)","v":0},0,0]
["Fuente: Departamento de Estadística — C.E.S."]
["Nota: Los docentes que dictan más de una asignatura son considerados como personas distintas en cada asignatura."]
["El cuadro muestra la cantidad de docentes titulados según la asignatura que dicta y no según la asignatura en la cual se tituló."]
["Se consideran los docentes activos y las horas de coordinación no están consideradas."]

{"sheet":"II-3.3.2","index":52,"n_rows":14,"n_cols":5,"rows_kept":14,"cut":false,"hidden":false,"merged":[[0,4,1,5],[4,0,4,3],[5,0,6,0],[5,1,6,1]]}
["CONSEJO DE EDUCACIÓN TÉCNICO PROFESIONAL (U.T.U.)",null,null,null,"PERSONAL DOCENTE"]
[]
["Cuadro Nº II-3.3.2."]
[]
["PERSONAL DOCENTE DEL CETP EN EDUCACIÓN MEDIA BÁSICA TECNOLÓGICA POR TIPO DE CURSO (Todo el país, 2017)"]
["EDUCACIÓN MEDIA BÁSICA","TOTAL"]
[]
[]
["TOTAL",{"$f":"SUM(B10:B13)","v":7412}]
["Ciclo Básico Tecnológico",3980]
["Ciclo Básico Tecnológico Agrario","S/D"]
["Formación Profesional Básica Plan 2007",2990]
["Articulación Educ.Media Básica",442]
["Fuente: U.T.U. División Informática."]

{"sheet":"II-3.4.1","index":53,"n_rows":26,"n_cols":4,"rows_kept":26,"cut":false,"hidden":false,"merged":[[26,0,26,2],[0,3,1,4],[4,0,4,2],[5,0,8,0],[5,1,6,2],[7,1,8,1],[7,2,8,2],[7,3,8,3]]}
["CONSEJO DE EDUCACIÓN SECUNDARIA",null,null,"GRUPOS"]
[]
["Cuadro Nº II-3.4.1."]
[]
["GRUPOS DEL CES EN EDUCACIÓN MEDIA BÁSICA GENERAL  COMPARADOS CON EL TOTAL DE GRUPOS EN EDUCACIÓN MEDIA GENERAL SEGÚN GRANDES ÁREAS Y FORMA DE ADMINISTRACIÓN (Todo el país, 2017)"]
["GRANDES ÁREAS Y FORMA DE ADMINISTRACIÓN","FORMA DE ADMINISTRACIÓN"]
[]
[null,"Grupos en Educación Media Básica General ","Total de grupos en Educación Media General","Promedio alumnos por grupo de Media Básica"]
[]
["TOTAL DEL PAÍS",{"$f":"B15+B20","v":5601},{"$f":"C15+C20","v":10211},{"$f":"'II-3.2.1 '!B9/'II-3.4.1'!B10","v":26.389573290483842}]
["MEDIA BÁSICA PÚBLICA",{"$f":"B12+B13","v":4541},{"$f":"C12+C13","v":7982},{"$f":"'II-3.2.1 '!B10/'II-3.4.1'!B11","v":27.150847830874255}]
["  Diurna",{"$f":"B17+B22","v":4069},{"$f":"C17+C22","v":6893},{"$f":"'II-3.2.1 '!B11/'II-3.4.1'!B12","v":26.410174490046696}]
["  Cuarto Turno",472,{"$f":"C18+C23","v":1089},{"$f":"'II-3.2.1 '!B12/'II-3.4.1'!B13","v":33.53601694915254}]
["MEDIA BÁSICA PRIVADA",1060,2229,{"$f":"'II-3.2.1 '!B13/'II-3.4.1'!B14","v":23.128301886792453}]
["TOTAL MONTEVIDEO",{"$f":"B16+B19","v":1999},{"$f":"C16+C19","v":3746},{"$f":"'II-3.2.1 '!B14/'II-3.4.1'!B15","v":27.350675337668836}]
["MEDIA BÁSICA PÚBLICA",{"$f":"B17+B18","v":1323},{"$f":"C17+C18","v":2228},{"$f":"'II-3.2.1 '!B15/'II-3.4.1'!B16","v":28.942554799697657}]
["  Diurna",1166,1852,{"$f":"'II-3.2.1 '!B16/'II-3.4.1'!B17","v":28.221269296740996}]
["  Cuarto Turno",157,376,{"$f":"'II-3.2.1 '!B17/'II-3.4.1'!B18","v":34.29936305732484}]
["MEDIA BÁSICA  PRIVADA",676,1518,{"$f":"'II-3.2.1 '!B18/'II-3.4.1'!B19","v":24.235207100591715}]
["TOTAL RESTO DEL PAÍS",{"$f":"B21+B24","v":3602},{"$f":"C21+C24","v":6465},{"$f":"'II-3.2.1 '!B19/'II-3.4.1'!B20","v":25.856191004997225}]
["MEDIA BÁSICA PÚBLICA",{"$f":"B22+B23","v":3218},{"$f":"C22+C23","v":5754},{"$f":"'II-3.2.1 '!B20/'II-3.4.1'!B21","v":26.414232442510876}]
["  Diurna",2903,5041,{"$f":"'II-3.2.1 '!B21/'II-3.4.1'!B22","v":25.682741991043748}]
["  Cuarto Turno",315,713,{"$f":"'II-3.2.1 '!B22/'II-3.4.1'!B23","v":33.155555555555559}]
["MEDIA  BÁSICA PRIVADA",384,711,{"$f":"'II-3.2.1 '!B23/'II-3.4.1'!B24","v":21.1796875}]
[]
["Fuente: D.E. — C.E.S."]

{"sheet":"MEDIA SUPERIOR ","index":54,"n_rows":143,"n_cols":2,"rows_kept":143,"cut":false,"hidden":false,"merged":[]}
[]
[]
[]
[]
[]
[]
[]
["Cuadro Nº II-4.1.1","ESTABLECIMIENTOS DE EDUCACIÓN MEDIA SUPERIOR POR MODALIDAD Y FORMA DE ADMINISTRACIÓN SEGÚN DEPARTAMENTO.  (Todo el país, 2017). "]
[""]
[""]
["Cuadro Nº II-4.2.1","ESTUDIANTES MATRICULADOS  DEL CES  EN EDUCACIÓN MEDIA SUPERIOR  GENERAL POR GRADO SEGÚN GRANDES ÁREAS Y FORMA DE ADMINISTRACIÓN.  (Todo el país, 2017). "]
[""]
["Cuadro Nº II-4.2.2","ESTUDIANTES MATRICULADOS EN EL CETP EN EDUCACIÓN MEDIA SUPERIOR TECNOLÓGICA POR TIPO DE CURSO SEGÚN GRANDES ÁREAS, DEPARTAMENTO Y SEXO.  (Todo el país, 2017). "]
[""]
["Cuadro Nº II-4.2.3","ESTUDIANTES MATRICULADOS EN EL CETP EN EDUCACIÓN MEDIA SUPERIOR POR TIPO DE CURSO SEGÚN EDAD.  (Todo el país, 2017). "]
[""]
["Cuadro Nº II-4.2.4","ESTUDIANTES MATRICULADOS EN EL CETP EN EDUCACIÓN MEDIA SUPERIOR TECNOLÓGICA POR TIPO DE CURSO SEGÚN SECTORES DE ESTUDIO.  (Todo el país, 2017). "]
[""]
["Cuadro Nº II-4.2.5","ESTUDIANTES MATRICULADOS EN EL CES EN EDUCACIÓN MEDIA SUPERIOR GENERAL POR GRADO Y FORMA DE ADMINISTRACIÓN SEGÚN DEPARTAMENTO.  (Todo el país, 2017). "]
[""]
["Cuadro Nº II-4.2.6","ESTUDIANTES MATRICULADOS EN EL CES EN QUINTO GRADO DE EDUCACIÓN MEDIA GENERAL PÚBLICA POR PLAN Y ORIENTACIÓN SEGÚN DEPARTAMENTO.  (Todo el país, 2017). "]
[""]
["Cuadro Nº II-4.2.7","ESTUDIANTES MATRICULADOS EN EL CES EN QUINTO GRADO DE EDUCACIÓN MEDIA SUPERIOR DE EDUCACIÓN SECUNDARIA PRIVADA POR ORIENTACIÓN SEGÚN DEPARTAMENTO.  (Todo el país, 2017). "]
[""]
["Cuadro Nº II-4.2.8","ESTUDIANTES MATRICULADOS EN EL CES EN SEXTO GRADO DE EDUCACIÓN MEDIA GENERAL PÚBLICA POR PLAN Y OPCIÓN SEGÚN DEPARTAMENTO.  (Todo el país, 2017). "]
[""]
["Cuadro Nº II-4.2.9","ESTUDIANTES MATRICULADOS EN EL CES EN SEXTO GRADO DE EDUCACIÓN MEDIA GENERAL PRIVADA POR OPCIÓN SEGÚN DEPARTAMENTO.  (Todo el país, 2017)."]
[""]
["Cuadro Nº II-4.2.10","ESTUDIANTES MATRICULADOS DE EDUCACIÓN MEDIA SUPERIOR PRIVADA  POR GRADO Y SEXO SEGÚN DEPARTAMENTO.  (Todo el país, 2017)."]
[""]
["Cuadro Nº II-4.2.11","ESTUDIANTES MATRICULADOS DE EDUCACIÓN MEDIA SUPERIOR PÚBLICA POR GRADO Y SEXO SEGÚN DEPARTAMENTO.  (Todo el país, 2017)."]
[""]
[""]
["Cuadro Nº II-4.3.1","PERSONAL DOCENTE Y HORAS DOCENTES DEL CES EN EDUCACIÓN MEDIA SUPERIOR GENERAL PÚBLICA POR CONDICIÓN DE TITULACIÓN.  (Todo el país, 2017)."]
[""]
["Cuadro Nº II-4.3.2","PERSONAL DOCENTE DEL CETP EN EDUCACIÓN MEDIA SUPERIOR TECNOLÓGICA POR TIPO DE CURSO.  (Todo el país, 2017)."]
[""]
[""]
["Cuadro Nº II-4.4.1","GRUPOS DE EDUCACIÓN MEDIA SUPERIOR GENERAL COMPARADOS CON EL TOTAL DE AMBOS CICLOS SEGÚN GRANDES ÁREAS Y FORMA DE ADMINISTRACIÓN.  (Todo el país, 2017)."]
[""]
[""]
[""]
[""]
[""]
[""]
[""]
[""]
[""]
[""]
[""]
[""]
[""]
[""]
[""]
[""]
[""]
[""]
[""]
[""]
[""]
[""]
[""]
[""]
[""]
[""]
[""]
[""]
[""]
[""]
[""]
[""]
[""]
[""]
[""]
[""]
[""]
[""]
[""]
[""]
[""]
[""]
[""]
[""]
[""]
[""]
[""]
[""]
[""]
[""]
[""]
[""]
[""]
[""]
[""]
[""]
[""]
[""]
[""]
[""]
[""]
[""]
[""]
[""]
[""]
[""]
[""]
[{"$f":"MID(B70,1,20)","v":""}]
[""]
[""]
[""]
[""]
[""]
[""]
[""]
[""]
[""]
[""]
[""]
[""]
[""]
[""]
[""]
[""]
[""]
[""]
[""]
[""]
[""]
[""]
[""]
[""]
[""]
[""]
[""]
[""]
[""]
[""]
[""]
[""]
[""]
[""]
[""]
[""]

{"sheet":"II-4.1.1 ","index":55,"n_rows":39,"n_cols":13,"rows_kept":39,"cut":false,"hidden":false,"merged":[[0,7,1,9],[4,0,4,10],[5,0,13,0],[5,2,5,12],[6,1,13,1],[6,3,6,9],[6,10,6,12],[7,3,7,10],[8,2,13,2],[8,3,9,6],[37,0,37,12],[38,0,39,12],[8,7,13,7],[8,8,12,9],[8,10,13,10],[9,11,12,12],[10,3,12,4],[10,5,12,6]]}
["CONSEJO DE EDUCACIÓN SECUNDARIA (CES) Y CONSEJO DE EDUCACIÓN TÉCNICO PROFESIONAL (UTU)",null,null,null,null,null,null,"ESTABLECIMIENTOS"]
[]
["Cuadro Nº II-4.1.1"]
[]
["ESTABLECIMIENTOS DE EDUCACIÓN MEDIA SUPERIOR POR MODALIDAD Y FORMA DE ADMINISTRACIÓN SEGÚN DEPARTAMENTO (Todo el país, 2017)"]
["DEPARTAMENTO",null,"MODALIDAD"]
[null,"TOTAL GENERAL",null,"CES",null,null,null,null,null,null,"CETP"]
[null,null,null,"FORMA DE ADMINISTRACIÓN"]
[null,null,"TOTAL LICEOS PÚBLICOS","LICEOS PÚBLICOS",null,null,null,"TOTAL LICEOS PRIVADOS","Liceos Privados",null,"TOTAL ESCUELAS DE CBT Y TÉCNICA"]
[null,null,null,null,null,null,null,null,null,null,null,"Escuelas de CBT y Técnica."]
[null,null,null,"Diurnos Oficiales",null,"Extra Edad Oficiales (Nocturno Y Diurno)"]
[]
[]
[null,null,null,"Bachillerato","C.Básico y Bachillerato","Bachillerato","C.Básico y Bachillerato",null,"Bachillerato","C.Básico y Bachillerato",null,"Escuelas de CBT y Técnica.","Reparticiones"]
["TOTAL",{"$f":"C15+H15+K15","v":617},{"$f":"SUM(D15:G15)","v":303},{"$f":"D16+D17","v":43},{"$f":"E16+E17","v":157},{"$f":"F16+F17","v":39},{"$f":"G16+G17","v":64},{"$f":"SUM(I15:J15)","v":157},{"$f":"I16+I17","v":6},{"$f":"J16+J17","v":151},{"$f":"L15+M15","v":157},{"$f":"L16+L17","v":131},{"$f":"M16+M17","v":26}]
["MONTEVIDEO",{"$f":"C16+H16+K16","v":191},{"$f":"SUM(D16:G16)","v":61},17,13,15,16,94,5,89,{"$f":"L16+M16","v":36},30,6]
["RESTO DEL PAÍS",426,{"$f":"SUM(C18:C35)","v":242},{"$f":"SUM(D18:D35)","v":26},{"$f":"SUM(E18:E35)","v":144},{"$f":"SUM(F18:F35)","v":24},{"$f":"SUM(G18:G35)","v":48},63,{"$f":"SUM(I18:I35)","v":1},{"$f":"SUM(J18:J35)","v":62},121,{"$f":"SUM(L18:L35)","v":101},{"$f":"SUM(M18:M35)","v":20}]
["Artigas",17,{"$f":"SUM(D18:G18)","v":11},2,7,1,1,1,0,1,5,4,1]
["Canelones",106,58,8,31,4,15,24,1,23,24,20,4]
["Cerro Largo",18,9,0,7,0,2,3,0,3,6,5,1]
["Colonia",33,19,2,9,3,5,1,0,1,13,10,3]
["Durazno",11,9,1,5,2,1,2,0,2,null,4,1]
["Flores",8,4,0,2,1,1,2,0,2,2,2,0]
["Florida",18,13,1,9,2,1,2,0,2,3,2,1]
["Lavalleja",11,7,0,6,1,0,0,0,0,4,3,1]
["Maldonado",34,15,1,9,1,4,11,0,11,8,7,1]
["Paysandú",22,11,2,7,1,1,2,0,2,9,6,3]
["Río Negro",13,9,1,5,1,2,1,0,1,3,3,0]
["Rivera",22,12,2,7,1,2,4,0,4,6,5,1]
["Rocha",18,12,1,7,1,3,1,0,1,5,5,0]
["Salto",21,12,1,9,1,1,3,0,3,6,4,2]
["San José",22,12,1,6,1,4,2,0,2,8,7,1]
["Soriano",18,11,1,5,2,3,1,0,1,6,6,0]
["Tacuarembó",18,12,1,9,0,2,2,0,2,4,4,0]
["Treinta y Tres",11,6,1,4,1,0,1,0,1,4,4,0]
[]
["Fuente: D.E.- C.E.S ."]
["Nota: 1- Los establecimientos considerados en el Tipo de Educación Escuelas con \"Ciclo Básico Rural” ya fueron considerados en los totales de establecimientos de Educación Primaria por lo cual, si bien se presentan en la columna  correspondiente, no participan en el “Total” del presente cuadro."]
["2- En un mismo establecimiento del CETP coexisten cursos de distintos nivel edcuativo. En este cuadro se exponen las escuelas que dictan cursos de EDUCACIÓN MEDIA SUPERIOR. Se incluyeron reparticiones (localizaciones) que no son establecimientos de activos de ANEP. "]

{"sheet":"II-4.2.1 ","index":56,"n_rows":29,"n_cols":5,"rows_kept":29,"cut":false,"hidden":false,"merged":[[24,0,24,4],[0,2,1,4],[0,7,1,7],[4,0,4,4],[5,0,7,0],[5,1,7,1],[5,2,6,4]]}
["CONSEJO DE EDUCACIÓN SECUNDARIA",null,"MATRICULADOS"]
[]
["Cuadro Nº II-4.2.1"]
[]
["ESTUDIANTES MATRICULADOS  DEL CES  EN EDUCACIÓN MEDIA SUPERIOR  GENERAL POR GRADO SEGÚN GRANDES ÁREAS Y FORMA DE ADMINISTRACIÓN (Todo el país, 2017)"]
["GRANDES ÁREAS Y FORMA DE ADMINISTRACIÓN","TOTAL","GRADO"]
[]
[null,null,"CUARTO","QUINTO","SEXTO"]
["TOTAL DEL PAÍS",{"$f":"C9+D9+E9","v":124544},{"$f":"C10+C13","v":45883},{"$f":"D10+D13","v":44088},{"$f":"E10+E13","v":34573}]
["MEDIA SUPERIOR PÚBLICA ",{"$f":"C10+D10+E10","v":107968},{"$f":"C11+C12","v":39346},{"$f":"D11+D12","v":38815},{"$f":"E11+E12","v":29807}]
["  Diurna",{"$f":"C11+D11+E11","v":71625},{"$f":"C16+C21","v":28438},24388,18799]
["  Cuarto Turno",36343,10908,14427,11008]
["MEDIA SUPERIOR PRIVADA",16576,6537,5273,4766]
["TOTAL MONTEVIDEO",48252,{"$f":"C15+C18","v":17261},{"$f":"D15+D18","v":17197},{"$f":"E15+E18","v":13794}]
["MEDIA SUPERIOR PÚBLICA ",36114,{"$f":"C16+C17","v":12697},{"$f":"D16+D17","v":13240},{"$f":"E16+E17","v":10177}]
["  Diurna",21343,8493,7384,5466]
["  Cuarto Turno",14771,4204,5856,4711]
["MEDIA SUPERIOR PRIVADA ",12138,4564,3957,3617]
["TOTAL RESTO DEL PAÍS",76292,{"$f":"C20+C23","v":28622},{"$f":"D20+D23","v":26891},{"$f":"E20+E23","v":20779}]
["MEDIA SUPERIOR PÚBLICA ",71854,{"$f":"C21+C22","v":26649},{"$f":"D21+D22","v":25575},{"$f":"E21+E22","v":19630}]
["  Diurna",50282,19945,17004,13333]
["  Cuarto Turno",21572,6704,8571,6297]
["MEDIA SUPERIOR PRIVADA ",4438,1973,1316,1149]
["Fuente: DE — CES"]
["Nota: La referencia \"Privada\" (incluye los Habilitados \"Liceo Naval\" y \"Liceo Militar\"), se corresponde con la de \"Liceos Habilitados\" presente en ediciones anteriores del Anuario Estadístico del MEC"]
["       "]
["        "]
["        "]
["        "]

{"sheet":"II-4.2.2 ","index":57,"n_rows":34,"n_cols":25,"rows_kept":34,"cut":false,"hidden":false,"merged":[[34,0,34,19],[0,7,1,7],[0,10,0,13],[5,0,10,0],[5,1,10,1],[5,2,8,3],[7,4,10,4],[7,5,7,6],[8,8,8,9],[8,11,8,12],[4,0,4,21],[9,5,10,5],[9,6,10,6],[7,7,10,7],[7,8,7,9],[7,10,10,10],[5,4,5,24],[6,4,6,24],[32,0,32,12],[8,5,8,6],[7,22,9,22],[7,23,7,24],[8,23,8,24],[9,23,10,23],[9,24,10,24],[9,20,10,20],[9,21,10,21],[7,19,10,19],[7,20,7,21],[8,17,8,18],[8,20,8,21],[7,17,7,18],[33,0,33,21],[9,2,10,2],[9,3,10,3],[7,14,7,15],[8,14,8,15],[7,16,9,16],[7,11,7,12],[7,13,10,13],[9,17,10,17],[9,18,10,18]]}
["CONSEJO DE EDUCACIÓN TÉCNICO PROFESIONAL (U.T.U.)",null,null,null,null,null,null,null,null,null," MATRICULADOS"]
[]
["Cuadro Nº II-4.2.2"]
[]
["ESTUDIANTES MATRICULADOS EN EL CETP EN EDUCACIÓN MEDIA SUPERIOR TECNOLÓGICA POR TIPO DE CURSO SEGÚN GRANDES ÁREAS, DEPARTAMENTO Y SEXO (Todo el país, 2017)"]
["GRANDES ÁREAS,DEPARTAMENTO Y SEXO ","TOTAL","TOTAL ",null,"Tipo de curso"]
[null,null,null,null,"EDUACIÓN VEDIA SUPERIOR TECONOLOGICA "]
[null,null,null,null,"TOTAL ","Bachillerato Migari",null,"TOTAL ","Bachillerato ProMesional Trayectos",null,"TOTAL ","Curso Técnico",null,null,"E. V. P. Especialización",null,"TOTAL ","Educación Vedia ProMesional",null,"TOTAL","Educación Vedia Tecnológica",null,"TOTAL","Tecnologica Minest"]
[null,null,null,null,null,"Sexo",null,null,null,null,null,"Sexo",null,null,"Sexo",null,null,"Sexo",null,null,"Sexo",null,null,"Sexo"]
[null,null,"MUJER","VARÓN",null,"M","V",null,"M","V",null,"M","V",null,"M","V",null,"M","V",null,"M","V"]
[null,null,null,null,null,null,null,null,"Count","Count",null,"Count","Count",null,null,null,null,"Count","Count",null,"Count","Count"]
["TOTAL ",{"$f":"C12+D12","v":47535},{"$f":"F12+I12+L12+O12+R12+U12+X12","v":19483},{"$f":"G12+J12+M12+P12+S12+V12+Y12","v":28052},{"$f":"F12+G12","v":425},{"$f":"F13+F14","v":256},{"$f":"G13+G14","v":169},{"$f":"I12+J12","v":1604},{"$f":"I13+I14","v":426},{"$f":"J13+J14","v":1178},{"$f":"L12+M12","v":354},{"$f":"L13+L14","v":335},{"$f":"M13+M14","v":19},{"$f":"O12+P12","v":19},{"$f":"O13+O14","v":10},{"$f":"P13+P14","v":9},{"$f":"R12+S12","v":14663},{"$f":"R13+R14","v":6528},{"$f":"S13+S14","v":8135},{"$f":"U12+V12","v":30440},{"$f":"U13+U14","v":11923},{"$f":"V13+V14","v":18517},{"$f":"X12+Y12","v":30},{"$f":"X13+X14","v":5},{"$f":"Y13+Y14","v":25}]
["Montevideo",{"$f":"C13+D13","v":18843},7142,11701,338,201,137,{"$f":"I13+J13","v":661},146,515,{"$f":"L13+M13","v":354},335,19,{"$f":"O13+P13","v":19},10,9,{"$f":"R13+S13","v":6040},2603,3437,{"$f":"U13+V13","v":11421},3845,7576,{"$f":"X13+Y13","v":10},2,8]
["RESTO DEL PAÍS",28692,{"$f":"F14+I14+L14+O14+R14+U14+X14","v":12341},16351,{"$f":"F14+G14","v":87},{"$f":"SUM(F15:F32)","v":55},{"$f":"SUM(G15:G32)","v":32},943,{"$f":"SUM(I15:I32)","v":280},{"$f":"SUM(J15:J32)","v":663},0,{"$f":"SUM(L15:L32)","v":0},{"$f":"SUM(M15:M32)","v":0},0,{"$f":"SUM(O15:O32)","v":0},{"$f":"SUM(P15:P32)","v":0},8623,{"$f":"SUM(R15:R32)","v":3925},{"$f":"SUM(S15:S32)","v":4698},19019,{"$f":"SUM(U15:U32)","v":8078},{"$f":"SUM(V15:V32)","v":10941},20,{"$f":"SUM(X15:X32)","v":3},{"$f":"SUM(Y15:Y32)","v":17}]
["Artigas",1858,951,907,{"$f":"F15+G15","v":35},20,15,{"$f":"I15+J15","v":55},16,39,{"$f":"L15+M15","v":0},0,0,{"$f":"O15+P15","v":0},0,0,{"$f":"R15+S15","v":752},380,372,{"$f":"U15+V15","v":1016},535,481,{"$f":"X15+Y15","v":0},0,0]
["Canelones",5966,2664,3302,{"$f":"F16+G16","v":0},0,0,{"$f":"I16+J16","v":227},77,150,{"$f":"L16+M16","v":0},0,0,{"$f":"O16+P16","v":0},0,0,{"$f":"R16+S16","v":1825},930,895,{"$f":"U16+V16","v":3906},1656,2250,{"$f":"X16+Y16","v":8},1,7]
["Cerro Largo",1269,582,687,0,0,0,6,0,6,0,0,0,0,0,0,354,170,184,909,412,497,0,0,0]
["Colonia",1808,717,1091,0,0,0,44,11,33,0,0,0,0,0,0,628,264,364,1136,442,694,0,0,0]
["Durazno",741,315,426,0,0,0,0,0,0,0,0,0,0,0,0,89,35,54,652,280,372,0,0,0]
["Flores",256,111,145,0,0,0,0,0,0,0,0,0,0,0,0,0,0,0,256,111,145,0,0,0]
["Florida",767,333,434,0,0,0,0,0,0,0,0,0,0,0,0,154,93,61,601,238,363,12,2,10]
["Lavalleja",709,324,385,0,0,0,28,3,25,null,0,0,0,0,0,328,157,171,353,164,189,0,0,0]
["Maldonado",2477,938,1539,0,0,0,142,50,92,0,0,0,0,0,0,962,403,559,1373,485,888,0,0,0]
["Paysandú",2066,790,1276,0,0,0,47,15,32,0,0,0,0,0,0,260,94,166,1759,681,1078,0,0,0]
["Rio Negro",881,313,568,0,0,0,19,0,19,0,0,0,0,0,0,182,41,141,680,272,408,0,0,0]
["Rivera",1488,662,826,52,35,17,21,9,12,0,0,0,0,0,0,216,133,83,1199,485,714,0,0,0]
["Rocha",777,356,421,0,0,0,32,9,23,0,0,0,0,0,0,336,136,200,409,211,198,0,0,0]
["Salto",2413,{"$f":"F28+I28+L28+O28+R28+U28+X28","v":990},1423,0,0,0,113,24,89,0,0,0,0,0,0,841,367,474,1459,599,860,0,0,0]
["San José",1340,638,702,0,0,0,51,12,39,0,0,0,0,0,0,607,292,315,682,334,348,0,0,0]
["Soriano",1570,696,874,0,0,0,48,28,20,0,0,0,0,0,0,436,187,249,1086,481,605,0,0,0]
["Tacuarembó",1591,646,945,0,0,0,89,24,65,0,0,0,0,0,0,499,176,323,1003,446,557,0,0,0]
["Treinta y Tres",715,315,400,0,0,0,21,2,19,0,0,0,0,0,0,154,67,87,540,246,294,0,0,0]
["Fuente : Procesamiento propio en base a datos proporcionados por el D.E. _ CETP (U.T.U. ) "]
["Nota: Los matriculados en Formación Profesional Superior, potencialmente son estudiantes de Educación Media Superior, ya que con el curso de Articulación correspondiente adquieren continuidad educativa a  nivel tericiario. "]

{"sheet":"II-4.2.3 ","index":58,"n_rows":23,"n_cols":9,"rows_kept":23,"cut":false,"hidden":false,"merged":[[23,0,23,8],[0,7,1,8],[4,0,4,9],[5,0,8,0],[5,1,8,1],[5,2,6,8],[7,2,7,8]]}
["CONSEJO DE EDUCACIÓN TÉCNICO PROFESIONAL (U.T.U.)",null,null,null,null,null,null,"MATRICULADOS"]
[]
["Cuadro Nº II-4.2.3"]
[]
["ESTUDIANTES MATRICULADOS EN EL CETP EN EDUCACIÓN MEDIA SUPERIOR POR TIPO DE CURSO SEGÚN EDAD (Todo el país, 2017)"]
["EDAD ","TOTAL ","TIPO DE CURSO "]
[]
[null,null,"EDUCACIÓN MEDIA SUPERIOR TECNOLÓGICA "]
[null,null,"Curso Técnico","E. M. P. Especialización","Educación Media Profesional","Educación Media Tecnológica","Bachillerato Profesional","Bachillerato Figari","Tecnológica Finest"]
["TOTAL ",{"$f":"C10+D10+E10++F10+G10+H10+I10","v":47535},{"$f":"SUM(C11:C21)","v":354},{"$f":"SUM(D11:D21)","v":19},14663,30440,1604,425,30]
["11 y 12 años ",{"$f":"C11+D11+E11++F11+G11+H11+I11","v":3},0,0,0,3,0,0,0]
["13 años ",0,0,0,0,0,0,0,0]
["14 años",56,0,0,8,47,0,1,0]
["15 años",4161,5,4,741,3388,0,23,0]
["16 años",6735,26,1,1686,4977,1,44,0]
["17 años",8080,38,3,1929,5831,232,47,0]
["18años",5998,32,3,1659,4007,224,69,4]
["19años",4433,43,1,1438,2719,211,21,0]
["20 a 24 años",9847,128,5,3451,5680,477,100,6]
["25 a 29 años",3936,51,0,1609,2053,178,39,6]
["30 años y más",4286,31,2,2142,1735,281,81,14]
[]
["Fuente: Procesamiento propio en base a datos proporcionados por el D.E. - CETP (U.T.U)"]

{"sheet":"II-4.2.4 ","index":59,"n_rows":35,"n_cols":9,"rows_kept":35,"cut":false,"hidden":false,"merged":[[4,0,4,10],[5,0,6,0],[5,1,6,1],[5,2,5,8],[33,0,33,10]]}
["CONSEJO DE EDUCACIÓN TÉCNICO PROFESIONAL (U.T.U.)",null,null,null,null,null,null,"MATRICULADOS"]
[]
["Cuadro Nº II-4.2.4."]
[]
["ESTUDIANTES MATRICULADOS EN EL CETP EN EDUCACIÓN MEDIA SUPERIOR TECNOLÓGICA POR TIPO DE CURSO SEGÚN SECTORES DE ESTUDIO (Todo el país, 2017)"]
["SECTORES DE ESTUDIO ","TOTAL","EDUCACIÓN MEDIA SUPERIOR TECNOLÓGICA"]
[null,null,"Curso Técnico","E. M. P. Especialización","Educación Media Profesional","Educación Media Tecnológica","Bachillerato Profesional","Bachillerato Figari","Tecnológica Finest"]
["TOTAL",{"$f":"SUM(B9:B32)","v":47535},{"$f":"SUM(C9:C32)","v":354},{"$f":"SUM(D9:D32)","v":19},14663,30440,1604,425,30]
["Agropecuario",{"$f":"SUM(C9:I9)","v":2538},0,0,250,2251,37,0,0]
["Artes y Artesanías",{"$f":"SUM(C10:I10)","v":387},0,0,0,0,0,387,0]
["Cerámica",38,0,0,0,0,0,38,0]
["Comercio y Administración",11587,0,0,3305,8260,22,0,0]
["Comunicación",348,0,0,0,348,0,0,0]
["Construcción y Arquitectura",2043,0,19,416,1524,84,0,0]
["Deporte y Afines",6567,0,0,226,6336,0,0,5]
["Electricidad y Electrónica",5739,0,0,2248,3047,444,0,0]
["Forestal",58,0,0,58,0,0,0,0]
["Gastronomía",3254,0,0,2752,0,502,0,0]
["Gráficos",156,0,0,12,144,0,0,0]
["Hortifruticultura y Jardinería",64,0,0,52,0,12,0,0]
["Hotelería",99,0,0,99,0,0,0,0]
["Informática",5812,0,0,281,5497,34,0,0]
["Madera y Muebles",833,0,0,757,0,76,0,0]
["Mant. Rep. y Serv. a la Producción",106,0,0,84,0,22,0,0]
["Mantenimiento y Rep. de Vehículos",2158,0,0,1562,377,219,0,0]
["Metal - Mecánica",1069,0,0,475,563,31,0,0]
["Nautica y Pesca",137,0,0,118,0,19,0,0]
["Protección al Medio Ambiente",86,0,0,61,0,25,0,0]
["Química, Termodinámica y Agroener.",1004,0,0,148,831,0,0,25]
["Servicios Personales",1835,154,0,1627,0,54,0,0]
["Textil y Confección de Vestimenta",355,200,0,132,0,23,0,0]
["Turismo",1262,0,0,0,1262,0,0,0]
["Fuente: D.E.- CETP (U.T.U.) "]
["Nota: Los cursos de Articulación no corresponden estrictamente a Educación Media Superior. El curso de Articulación brinda la posibilidad de adquirir el nivel educativo para Terciario. De esta manera se entiende que su inclusión en Educación Media Superior parece más apropiada que su inclusión en nivel terciario dentro de la oferta educativa del CETP. "]
["En Educación Media Tecnológica se sumaron 17 estudiantes que corresponden al curso Educación Media Tecnológica Finest y sector de estudio Química, Termodinámica y Agroenergía"]

{"sheet":"II-4.2.5","index":60,"n_rows":32,"n_cols":7,"rows_kept":32,"cut":false,"hidden":false,"merged":[[31,0,31,6],[0,4,1,6],[4,0,4,6],[5,0,8,0],[5,1,5,6],[6,1,6,2],[6,3,6,4],[6,5,6,6],[7,1,7,6]]}
["CONSEJO DE EDUCACIÓN SECUNDARIA",null,null,null,"MATRICULADOS"]
[]
["Cuadro Nº II-4.2.5."]
[]
["ESTUDIANTES MATRICULADOS EN EL CES EN EDUCACIÓN MEDIA SUPERIOR GENERAL POR GRADO Y FORMA DE ADMINISTRACIÓN SEGÚN DEPARTAMENTO (Todo el país, 2017)"]
["DEPARTAMENTO","GRADO"]
[null,"CUARTO",null,"QUINTO",null,"SEXTO"]
[null,"FORMA DE ADMINISTRACIÓN"]
[null,"Públicos","Privados","Públicos","Privados","Públicos","Privados"]
["TOTAL",{"$f":"SUM(B11:B12)","v":39346},6537,38815,5273,{"$f":"SUM(F11:F12)","v":29807},4766]
["MONTEVIDEO",12697,4564,13240,3957,10177,3617]
["RESTO DEL PAÍS",{"$f":"SUM(B13:B30)","v":26649},1973,25575,1316,{"$f":"SUM(F13:F30)","v":19630},1149]
["Artigas",1071,18,1002,14,774,0]
["Canelones",6882,775,6289,545,4717,537]
["Cerro Largo",1131,99,1112,46,938,56]
["Colonia",1393,12,1401,0,1128,0]
["Durazno",756,60,663,0,558,0]
["Flores",338,35,396,0,266,0]
["Florida",879,64,871,65,582,34]
["Lavalleja",698,0,752,0,632,0]
["Maldonado",2493,407,2647,355,2003,311]
["Paysandú",1291,163,1312,115,1018,84]
["Río Negro",686,13,607,0,504,0]
["Rivera",1712,62,1545,29,1159,18]
["Rocha",1361,0,1090,3,845,0]
["Salto ",1424,84,1518,90,1265,57]
["San José",1394,34,1520,0,916,0]
["Soriano",1015,52,1011,0,882,0]
["Tacuarembó",1344,78,1216,54,919,52]
["Treinta y Tres",781,17,623,0,524,0]
["Fuente: DE — CES"]
["Nota:  La referencia \"Privados\" (incluye los Habilitados \"Liceo Naval\" y \"Liceo Militar\"), se corresponde con la de \"Liceos Habilitados\" presente en ediciones anteriores del Anuario Estadístico del MEC"]

{"sheet":"II-4.2.6","index":61,"n_rows":32,"n_cols":11,"rows_kept":32,"cut":false,"hidden":false,"merged":[[7,5,9,5],[7,4,9,4],[6,2,9,2],[6,6,9,6],[0,4,1,4],[0,7,1,9],[4,0,4,17],[5,0,9,0],[5,1,9,1],[5,3,5,10],[6,3,6,5],[8,8,9,8],[7,3,9,3],[6,7,6,10],[8,9,9,9],[8,10,9,10],[8,7,9,7]]}
["CONSEJO DE EDUCACIÓN SECUNDARIA",null,null,null,null,null,null,"MATRICULADOS"]
[]
["Cuadro Nº II-4.2.6"]
[]
["ESTUDIANTES MATRICULADOS EN EL CES EN QUINTO GRADO DE EDUCACIÓN MEDIA GENERAL PÚBLICA POR PLAN Y ORIENTACIÓN SEGÚN DEPARTAMENTO (Todo el país, 2017)"]
["DEPARTAMENTO","TOTAL GENERAL"]
[null,null,"TOTAL PLAN 94","ORIENTACIÓN  PLAN / 94",null,null,"TOTAL PLAN 06","ORIENTACIÓN  PLAN / REFORMULACIÓN 2006"]
[null,null,null,"2º H","2º B","2º C"]
[null,null,null,null,null,null,null,"DivHum","DivBiol","DivCient","DivArt"]
[]
["TOTAL",{"$f":"SUM(C11+G11)","v":38815},{"$f":"SUM(D11:F11)","v":14427},{"$f":"SUM(D12:D13)","v":8220},5349,858,{"$f":"SUM(H11:K11)","v":24388},{"$f":"SUM(H12:H13)","v":9635},{"$f":"SUM(I12:I13)","v":8973},{"$f":"SUM(J12:J13)","v":3423},{"$f":"SUM(K12:K13)","v":2357}]
["MONTEVIDEO",{"$f":"SUM(C12+G12)","v":13240},5856,3347,1988,521,7384,2874,2366,1200,944]
["RESTO DEL PAÍS",25575,8571,{"$f":"SUM(D14:D31)","v":4873},3361,337,17004,{"$f":"SUM(H14:H31)","v":6761},{"$f":"SUM(I14:I31)","v":6607},{"$f":"SUM(J14:J31)","v":2223},{"$f":"SUM(K14:K31)","v":1413}]
["Artigas",1002,251,164,79,8,751,361,297,56,37]
["Canelones",6289,2379,1357,870,152,3910,1508,1389,605,408]
["Cerro Largo",1112,324,204,120,0,788,369,292,70,57]
["Colonia",1401,530,322,208,0,871,259,308,195,109]
["Durazno",663,185,103,82,0,478,214,153,73,38]
["Flores",396,148,75,73,0,248,50,116,54,28]
["Florida",871,283,190,93,0,588,235,241,73,39]
["Lavalleja",752,123,68,55,0,629,315,215,64,35]
["Maldonado",2647,960,481,403,76,1687,638,626,229,194]
["Paysandú",1312,389,168,193,28,923,313,470,102,38]
["Río Negro",607,245,149,96,0,362,136,162,37,27]
["Rivera",1545,427,303,111,13,1118,571,390,112,45]
["Rocha",1090,390,211,179,0,700,280,244,83,93]
["Salto ",1518,333,180,131,22,1185,476,534,121,54]
["San José",1520,687,355,294,38,833,294,347,133,59]
["Soriano",1011,388,260,128,0,623,204,268,93,58]
["Tacuarembó",1216,308,173,135,0,908,377,368,94,69]
["Treinta y Tres",623,221,110,111,0,402,161,187,29,25]
["Fuente: DE — CES"]

{"sheet":"II-4.2.7 ","index":62,"n_rows":36,"n_cols":7,"rows_kept":36,"cut":false,"hidden":false,"merged":[[10,4,11,4],[10,5,11,5],[10,6,11,6],[0,5,1,7],[4,0,4,10],[6,0,6,7],[8,0,11,0],[8,1,11,1],[8,2,8,6],[8,9,11,10],[9,2,9,5],[10,2,11,2],[10,3,11,3]]}
["CONSEJO DE EDUCACIÓN SECUNDARIA",null,null,null,null," MATRICULADOS"]
[]
["Cuadro Nº II-4.2.7"]
[]
[]
[]
["ESTUDIANTES MATRICULADOS EN EL CES EN QUINTO GRADO DE EDUCACIÓN MEDIA SUPERIOR DE EDUCACIÓN SECUNDARIA PRIVADA POR ORIENTACIÓN SEGÚN DEPARTAMENTO (Todo el país, 2017)"]
[]
["DEPARTAMENTO","TOTAL","QUINTO GRADO DE EDUCACIÓN MEDIA GENERAL"]
[null,null,"ORIENTACIÓN Planes 86+93+2006",null,null,null,"OTROS (*)"]
[null,null,"Humanística","Biológica","Científica","Artístico","BINT y/o BICUL"]
[]
["TOTAL",{"$f":"C13+D13+E13+F13+G13","v":5273},{"$f":"C14+C15","v":1662},{"$f":"D14+D15","v":1558},{"$f":"E14+E15","v":1647},{"$f":"F14+F15","v":292},{"$f":"G14+G15","v":114}]
["MONTEVIDEO",{"$f":"C14+D14+E14+F14+G14","v":3957},1281,1068,1244,250,114]
["RESTO DEL PAÍS",1316,{"$f":"SUM(C16:C33)","v":381},{"$f":"SUM(D16:D33)","v":490},{"$f":"SUM(E16:E33)","v":403},{"$f":"SUM(F16:F33)","v":42},{"$f":"SUM(G16:G33)","v":0}]
["Artigas",14,0,7,7,0,0]
["Canelones",545,179,179,166,21,0]
["Cerro Largo",46,6,23,17,0,0]
["Colonia",0,0,0,0,0,0]
["Durazno",0,0,0,0,0,0]
["Flores",0,0,0,0,0,0]
["Florida",65,19,28,18,0,0]
["Lavalleja",0,0,0,0,0,0]
["Maldonado",355,94,140,105,16,0]
["Paysandú",115,31,42,42,0,0]
["Río Negro",0,0,0,0,0,0]
["Rivera",29,11,12,6,0,0]
["Rocha",3,3,0,0,0,0]
["Salto ",90,28,30,27,5,0]
["San José",0,0,0,0,0,0]
["Soriano",0,0,0,0,0,0]
["Tacuarembó",54,10,29,15,0,0]
["Treinta y Tres",0,0,0,0,0,0]
["Fuente: DE — CES"]
["Nota:   Otros (*) Corresponde a los cursos de Bachillerato Internacional y"]
["        Bachillerato Bicultural"]

{"sheet":"II-4.2.8","index":63,"n_rows":33,"n_cols":17,"rows_kept":33,"cut":false,"hidden":false,"merged":[[8,11,10,11],[8,12,10,12],[8,13,10,13],[8,14,10,14],[8,15,10,15],[0,3,1,4],[6,0,10,0],[6,1,10,1],[6,3,7,8],[8,3,10,3],[8,4,10,4],[8,5,10,5],[5,2,5,16],[6,2,10,2],[8,10,10,10],[8,6,10,6],[8,7,10,7],[8,8,10,8],[6,10,7,16],[8,16,10,16],[6,9,10,9]]}
["CONSEJO DE EDUCACIÓN SECUNDARIA",null,null,"MATRICULADOS"]
[]
["Cuadro Nº II-4.2.8",null,"VOLVER"]
[]
["ESTUDIANTES MATRICULADOS EN EL CES EN SEXTO GRADO DE EDUCACIÓN MEDIA GENERAL PÚBLICA POR PLAN Y OPCIÓN SEGÚN DEPARTAMENTO (Todo el país, 2017)"]
[null,null,"SEXTO GRADO"]
["DEPARTAMENTO","TOTAL GENERAL","TOTAL Plan 94","O P C I Ó N   P L A N /  94",null,null,null,null,null,"Total Plan Ref. 06","O P C I Ó N      P L A N  / R E F O R M U L A C I Ó N  2006"]
[]
[null,null,null,"3º DER","3º ECO","3º AGR","3º MED","3º ARQ","3º ING",null,"Social Humanístico","Social Economía","Ciencias Agrarias","Ciencias Biológicas","Física Matemática","Matemática Diseño","Arte y Expresión"]
[]
[]
["TOTAL",{"$f":"SUM(C12+J12)","v":29807},{"$f":"SUM(D12:I12)","v":11008},{"$f":"D13+D14","v":5471},738,74,4071,143,511,{"$f":"SUM(K12:Q12)","v":18799},{"$f":"K13+K14","v":6318},{"$f":"L13+L14","v":1826},475,6453,1486,730,1511]
["MONTEVIDEO",{"$f":"SUM(C13+J13)","v":774},166,107,0,0,59,0,0,{"$f":"SUM(K13:Q13)","v":608},243,42,11,231,47,13,21]
["RESTO DEL PAÍS",29033,10842,{"$f":"SUM(D15:D32)","v":5364},738,74,4012,143,511,{"$f":"SUM(J15:J32)","v":18191},{"$f":"SUM(K15:K32)","v":6075},{"$f":"SUM(L15:L32)","v":1784},464,6222,1439,717,1490]
["Artigas",4717,1800,920,121,11,644,22,82,{"$f":"SUM(K15:Q15)","v":2917},924,313,61,931,282,150,256]
["Canelones",938,287,164,0,0,123,0,0,651,270,43,14,225,29,16,54]
["Cerro Largo",1128,396,191,27,0,178,0,0,732,214,87,51,207,86,39,48]
["Colonia",558,158,80,0,0,78,0,0,400,147,35,19,135,27,16,21]
["Durazno",266,81,36,0,0,45,0,0,185,49,23,8,68,22,8,7]
["Flores",582,179,95,0,0,84,0,0,403,133,25,11,163,35,10,26]
["Florida",632,106,67,0,0,39,0,0,526,228,44,14,173,32,16,19]
["Lavalleja",2003,631,289,51,18,227,15,31,1372,494,110,33,473,92,49,121]
["Maldonado",10177,4711,2257,477,21,1542,102,312,5466,1707,684,68,1613,475,249,670]
["Paysandú",1018,328,117,31,13,145,4,18,690,223,61,30,302,25,23,26]
["Río Negro",504,181,101,3,0,77,0,0,323,107,16,18,126,29,0,27]
["Rivera",1159,291,194,0,0,84,0,13,868,369,46,28,324,55,18,28]
["Rocha",845,265,128,0,0,137,0,0,580,183,62,8,224,26,23,54]
["Salto ",1265,293,131,6,11,124,0,21,972,366,55,17,434,41,25,34]
["San José",916,440,186,9,0,218,0,27,476,139,31,16,191,59,15,25]
["Soriano",882,317,185,13,0,112,0,7,565,150,51,36,210,56,27,35]
["Tacuarembó",919,201,119,0,0,82,0,0,718,243,72,29,284,42,20,28]
["Treinta y Tres",524,177,104,0,0,73,0,0,347,129,26,3,139,26,13,11]
["Fuente: DE — CES"]

{"sheet":"II-4.2.9 ","index":64,"n_rows":30,"n_cols":10,"rows_kept":30,"cut":false,"hidden":false,"merged":[[29,0,29,5],[30,0,30,5],[0,3,1,3],[0,4,1,5],[4,0,4,9],[5,0,6,0],[5,1,6,1],[5,2,5,8]]}
["CONSEJO DE EDUCACIÓN SECUNDARIA",null,null,null,"MATRICULADOS"]
[]
["Cuadro Nº II-4.2.9"]
[]
["ESTUDIANTES MATRICULADOS EN EL CES EN SEXTO GRADO DE EDUCACIÓN MEDIA GENERAL PRIVADA POR OPCIÓN SEGÚN DEPARTAMENTO (Todo el país, 2017)"]
["DEPARTAMENTO","TOTAL"," TODOS LOS PLANES OPCIÓN SEXTO GRADO",null,null,null,null,null,null,"Otros (*)"]
[null,null,"Social Humanístico","Social Economía","Ciencias Agrarias","Ciencias Biológicas","Física Matemática","Matemática Diseño","Arte y Expresión","B.INT.y/o BICUL."]
["TOTAL",{"$f":"SUM(C8:J8)","v":4766},{"$f":"C9+C10","v":1021},{"$f":"D9+D10","v":928},125,1165,855,331,225,116]
["MONTEVIDEO",{"$f":"SUM(C9:J9)","v":3617},753,734,83,800,689,262,180,116]
["RESTO DEL PAÍS",1149,{"$f":"SUM(C11:C28)","v":268},{"$f":"SUM(D11:D28)","v":194},42,365,166,69,45,0]
["Artigas",0,0,0,0,0,0,0,0,0]
["Canelones",537,130,90,22,169,65,29,32,0]
["Cerro Largo",56,11,7,0,22,7,9,0,0]
["Colonia",0,0,0,0,0,0,0,0,0]
["Durazno",0,0,0,0,0,0,0,0,0]
["Flores",0,0,0,0,0,0,0,0,0]
["Florida",34,7,7,0,11,9,0,0,0]
["Lavalleja",0,0,0,0,0,0,0,0,0]
["Maldonado",311,73,61,9,86,41,28,13,0]
["Paysandú",84,21,13,5,34,11,0,0,0]
["Río Negro",0,0,0,0,0,0,0,0,0]
["Rivera",18,4,3,0,6,4,1,0,0]
["Rocha",0,0,0,0,0,0,0,0,0]
["Salto ",57,10,10,6,18,13,0,0,0]
["San José",0,0,0,0,0,0,0,0,0]
["Soriano",0,0,0,0,0,0,0,0,0]
["Tacuarembó",52,12,3,0,19,16,2,0,0]
["Treinta y Tres",0,0,0,0,0,0,0,0,0]
["Fuente D.E - CES"]
["Nota: Otros (*) Corresponde a los cursos de Bachillerato Internacional y Bachillerato Bicultural. "]

{"sheet":"II-4.2.10","index":65,"n_rows":33,"n_cols":7,"rows_kept":33,"cut":false,"hidden":false,"merged":[[4,0,4,6],[6,0,9,0],[6,1,6,6],[7,1,7,2],[7,3,7,4],[7,5,7,6],[8,1,8,6]]}
["CONSEJO DE EDUCACIÓN SECUNDARIA"]
[]
["Cuadro Nº II-4.2.10"]
[]
["ESTUDIANTES MATRICULADOS DE EDUCACIÓN MEDIA SUPERIOR PRIVADA  POR GRADO Y SEXO SEGÚN DEPARTAMENTO (Todo el país, 2017)"]
[]
["DEPARTAMENTO","GRADO"]
[null,"CUARTO",null,"QUINTO",null,"SEXTO"]
[null,"SEXO"]
[null,"Mujer","Varón","Mujer","Varón","Mujer","Varón"]
["TOTAL",{"$f":"B12+B13","v":3251},3254,2704,2569,2495,2271]
["MONTEVIDEO",2259,2273,2050,1907,1873,1744]
["RESTO DEL PAÍS",{"$f":"SUM(B14:B31)","v":992},981,654,662,622,527]
["Artigas",8,10,6,8,0,0]
["Canelones",408,367,271,274,288,249]
["Cerro Largo",49,50,19,27,24,32]
["Colonia",6,6,0,0,0,0]
["Durazno",24,36,0,0,0,0]
["Flores",17,18,0,0,0,0]
["Florida",31,33,39,26,18,16]
["Lavalleja",0,0,0,0,0,0]
["Maldonado",188,219,169,186,165,146]
["Paysandú",74,89,65,50,50,34]
["Río Negro",9,4,0,0,0,0]
["Rivera",32,30,18,11,10,8]
["Rocha",0,0,3,0,0,0]
["Salto ",44,40,42,48,34,23]
["San José",16,18,0,0,0,0]
["Soriano",34,18,0,0,0,0]
["Tacuarembó",43,35,22,32,33,19]
["Treinta y Tres",9,8,0,0,0,0]
["Fuente: DE — CES"]
["Nota: Las diferencias con la matrícula de otros cuadros se debe a la ausencia de información sobre sexo en algunos colegios."]

{"sheet":"II-4.2.11","index":66,"n_rows":32,"n_cols":7,"rows_kept":32,"cut":false,"hidden":false,"merged":[[4,0,4,6],[6,0,9,0],[6,1,6,6],[7,1,7,2],[7,3,7,4],[7,5,7,6],[8,1,8,6]]}
["CONSEJO DE EDUCACIÓN SECUNDARIA"]
[]
["Cuadro Nº II-4.2.11"]
[]
["ESTUDIANTES MATRICULADOS DE EDUCACIÓN MEDIA SUPERIOR PÚBLICA  POR GRADO Y SEXO SEGÚN DEPARTAMENTO (Todo el país, 2017)"]
[]
["DEPARTAMENTO","GRADO"]
[null,"CUARTO",null,"QUINTO",null,"SEXTO"]
[null,"SEXO"]
[null,"Mujeres","Varones","Mujeres","Varones","Mujeres","Varones"]
["TOTAL",{"$f":"B12+B13","v":22853},16493,23556,15259,18422,11385]
["MONTEVIDEO",7390,5307,7915,5325,6104,4073]
["RESTO DEL PAÍS",{"$f":"SUM(B14:B31)","v":15463},11186,15641,9934,12318,7312]
["Artigas",622,449,628,374,500,274]
["Canelones",3952,2930,3831,2458,2899,1818]
["Cerro Largo",655,476,633,479,596,342]
["Colonia",820,573,853,548,708,420]
["Durazno",447,309,392,271,336,222]
["Flores",194,144,224,172,143,123]
["Florida",494,385,546,325,373,209]
["Lavalleja",391,307,464,288,393,239]
["Maldonado",1429,1064,1564,1083,1221,782]
["Paysandú",807,484,851,461,665,353]
["Río Negro",439,247,385,222,333,171]
["Rivera",977,735,934,611,728,431]
["Rocha",730,631,629,461,480,365]
["Salto ",813,611,995,523,831,434]
["San José",802,592,924,596,613,303]
["Soriano",638,377,636,375,570,312]
["Tacuarembó",814,530,762,454,578,341]
["Treinta y Tres",439,342,390,233,351,173]
["Fuente: DE — CES"]

{"sheet":"II-4.3.1 ","index":67,"n_rows":43,"n_cols":7,"rows_kept":43,"cut":false,"hidden":false,"merged":[[0,5,1,6],[0,7,1,7],[4,0,4,6],[6,0,7,0],[6,1,7,1],[6,2,6,3],[6,4,7,4],[6,5,6,6]]}
["CONSEJO DE EDUCACIÓN SECUNDARIA",null,null,null,null,"PERSONAL DOCENTE"]
[]
["Cuadro Nº II-4.3.1"]
[]
["PERSONAL DOCENTE Y HORAS DOCENTES DEL CES EN EDUCACIÓN MEDIA SUPERIOR GENERAL PÚBLICA POR CONDICIÓN DE TITULACIÓN (Todo el país, 2017)"]
[]
["ASIGNATURAS","TOTAL DOCENTES","PERSONAL DOCENTE",null,"TOTAL HORAS ","HORAS DOCENTES"]
[null,null,"Titulados","No Titulados",null,"Titulados","No Titulados"]
["TOTAL",{"$f":"SUM(C9:D9)","v":9818},{"$f":"SUM(C10:C39)","v":6695},{"$f":"SUM(D10:D39)","v":3123},{"$f":"SUM(F9:G9)","v":9818},{"$f":"SUM(F10:F39)","v":7024},{"$f":"SUM(G10:G39)","v":2794}]
["ACTIVIDADES ADAPTADAS AL MEDIO",{"$f":"+C10+D10","v":0},0,0,{"$f":"+F10+G10","v":0},0,0]
["ASTRONOMÍA",{"$f":"+C11+D11","v":183},56,127,{"$f":"+F11+G11","v":183},62,121]
["BIOLOGÍA",879,698,181,879,721,158]
["CIENCIAS FÍSICAS",0,0,0,0,0,0]
["COMUNICACIÓN VISUAL - DIBUJO",528,343,185,528,367,161]
["CONTABILIDAD",157,15,142,157,19,138]
["CURRÍCULO ABIERTO",0,0,0,0,0,0]
["ECONOMÍA",138,72,66,138,76,62]
["EDUCACIÓN FÍSICA",342,305,37,342,322,20]
["EDUCACIÓN SOCIAL Y CÍVICA",693,575,118,693,611,82]
["ESTUDIOS ECONÓMICOS",215,192,23,215,199,16]
["EXP.CORPORAL Y DANZA",44,5,39,44,5,39]
["EXP.CORPORAL Y TEATRO",55,11,44,55,13,42]
["FILOSOFÍA",760,573,187,760,606,154]
["FÍSICA",733,427,306,733,444,289]
["GEOGRAFÍA",200,153,47,200,161,39]
["GEOLOGÍA",6,0,6,6,0,6]
["HISTORIA",969,824,145,969,869,100]
["IDIOMA ESPAÑOL",0,0,0,0,0,0]
["INFORMÁTICA",0,0,0,0,0,0]
["INGLÉS",766,348,418,766,368,398]
["ITALIANO",75,30,45,75,31,44]
["LENG.COMUNIC.Y MEDIOS AUDIOV.",46,10,36,46,12,34]
["LENGUAJE DE SEÑAS",1,1,0,1,1,0]
["LITERATURA",896,697,199,896,739,157]
["MATEMATICA",1182,728,454,1182,750,432]
["MÚSICA",85,43,42,85,45,40]
["QUÍMICA",771,546,225,771,558,213]
["REC.NATURALES Y PAIS.AGRARIO",43,31,12,43,31,12]
["TEATRO",51,12,39,51,14,37]
["Fuente: Departamento de Estadística — CES"]
["Nota: Los docentes que dictan más de una asignatura son considerados como personas distintas en cada asignatura."]
["El cuadro muestra la cantidad de docentes titulados según la asignatura que dicta y no según la asignatura en la cual se tituló."]
["Se consideran los docentes activos y las horas de coordinación no están consideradas."]

{"sheet":"II-4.3.2","index":68,"n_rows":19,"n_cols":5,"rows_kept":19,"cut":false,"hidden":false,"merged":[[0,4,1,5],[0,7,1,7],[4,0,4,3],[5,0,6,0],[5,1,6,1],[0,0,0,2]]}
["CONSEJO DE EDUCACIÓN TÉCNICO PROFESIONAL (U.T.U.)",null,null,null,"PERSONAL DOCENTE"]
[]
["Cuadro Nº II-4.3.2"]
[]
["PERSONAL DOCENTE DEL CETP EN EDUCACIÓN MEDIA SUPERIOR TECNOLÓGICA POR TIPO DE CURSO (Todo el país, 2017)"]
["EDUCACIÓN MEDIA SUPERIOR TECNOLÓGICA","TOTAL"]
[]
["TOTAL",{"$f":"SUM(B9:B18)","v":15085}]
["Bachillerato Figari",57]
["Bachillerato Profesional",874]
["Educación Media Profesional",2809]
["Educación Media Prof. De Especialización",1]
["Educación Media Tecnológica",4924]
["Educación Media Superior",6307]
["Articulación a Nivel Terciario",0]
["Curso Técnico",92]
["Tutorías",2]
["Educación Media Tecnológica Fin.",19]
["Fuente: U.T.U. División Informática."]

{"sheet":"II-4.4.1","index":69,"n_rows":28,"n_cols":4,"rows_kept":28,"cut":false,"hidden":false,"merged":[[0,2,1,3],[0,7,1,7],[4,0,4,2],[5,0,6,0],[23,0,23,2]]}
["CONSEJO DE EDUCACIÓN SECUNDARIA",null,"GRUPOS"]
[]
["Cuadro Nº II-4.4.1"]
[]
["GRUPOS DE EDUCACIÓN MEDIA SUPERIOR GENERAL COMPARADOS CON EL TOTAL DE AMBOS CICLOS SEGÚN GRANDES ÁREAS Y FORMA DE ADMINISTRACIÓN (Todo el país, 2017)"]
[null,"FORMA DE ADMINISTRACIÓN"]
[null,"Grupos en Educación Media Superior General","Total de Grupos en Educación Media General","Promedio de alumnos por grupo de Media Superior"]
["TOTAL DEL PAÍS",{"$f":"B9+B12","v":4610},{"$f":"C9+C12","v":10211},{"$f":"'II-4.2.1 '!B9/'II-4.4.1'!B8","v":27.016052060737525}]
["EDUCACIÓN MEDIA SUPERIOR PÚBLICA",{"$f":"B10+B11","v":3441},{"$f":"C10+C11","v":7982},{"$f":"'II-4.2.1 '!B10/'II-4.4.1'!B9","v":31.376925312409185}]
["  Diurna",{"$f":"B15+B20","v":2824},6893,{"$f":"'II-4.2.1 '!B11/'II-4.4.1'!B10","v":25.362960339943342}]
["  Nocturna",617,1089,{"$f":"'II-4.2.1 '!B12/'II-4.4.1'!B11","v":58.902755267423018}]
["EDUCACIÓN MEDIA SUPERIOR PRIVADA",1169,2229,{"$f":"'II-4.2.1 '!B13/'II-4.4.1'!B12","v":14.179640718562874}]
["TOTAL MONTEVIDEO",{"$f":"B14+B17","v":1747},{"$f":"C14+C17","v":3746},{"$f":"'II-4.2.1 '!B14/'II-4.4.1'!B13","v":27.619919862621636}]
["EDUCACIÓN MEDIA SUPERIOR PÚBLICA",{"$f":"B15+B16","v":905},{"$f":"C15+C16","v":2228},{"$f":"'II-4.2.1 '!B15/'II-4.4.1'!B14","v":39.904972375690605}]
["  Diurna",686,1852,{"$f":"'II-4.2.1 '!B16/'II-4.4.1'!B15","v":31.112244897959183}]
["  Nocturna",219,376,{"$f":"'II-4.2.1 '!B17/'II-4.4.1'!B16","v":67.447488584474883}]
["EDUCACIÓN MEDIA SUPERIOR PRIVADA",842,1518,{"$f":"'II-4.2.1 '!B18/'II-4.4.1'!B17","v":14.415676959619953}]
["TOTAL RESTO DEL PAÍS",{"$f":"B19+B22","v":2863},{"$f":"C19+C22","v":6465},{"$f":"'II-4.2.1 '!B19/'II-4.4.1'!B18","v":26.647572476423331}]
["EDUCACIÓN MEDIA SUPERIOR PÚBLICA",{"$f":"B20+B21","v":2536},{"$f":"C20+C21","v":5754},{"$f":"'II-4.2.1 '!B20/'II-4.4.1'!B19","v":28.33359621451104}]
["  Diurna",2138,5041,{"$f":"'II-4.2.1 '!B21/'II-4.4.1'!B20","v":23.518241347053319}]
["  Nocturna",398,713,{"$f":"'II-4.2.1 '!B22/'II-4.4.1'!B21","v":54.201005025125632}]
["EDUCACIÓN MEDIA SUPERIOR PRIVADA",327,711,{"$f":"'II-4.2.1 '!B23/'II-4.4.1'!B22","v":13.571865443425077}]
["Fuente: DE — CES"]
["Nota: El “Total de ambos Ciclos” presenta de manera agregada la cantidad  total de grupos con que cuente Educación Secundaria y es el resultado de adicionar al total de Grupos del presente cuadro (Ciclo Superior de Educación Secundaria), el total de los grupos presentados en el Cuadro II-3.4.1 (Ciclo Básico de Educación Secundaria)"]
["       "]
["        "]
["        "]
["        "]

{"sheet":"TERCIARIA NO UNIVERSITARIA","index":70,"n_rows":112,"n_cols":2,"rows_kept":112,"cut":false,"hidden":false,"merged":[]}
[]
[]
[]
[]
[]
[]
[]
["Cuadro II-5.1.1","MATRÍCULA Y PERSONAL DOCENTE POR SEXO SEGÚN GRANDES ÁREAS, DEPARTAMENTOS E INSTITUCIONES.  (Todo el país, 2017). "]
[""]
[]
["Cuadro II-5.2.1","ESTUDIANTES INGRESADOS, MATRICULADOS Y EGRESADOS EN NIVEL TERCIARIO NO UNIVERSITARIO DEL ÁREA SEGURIDAD Y DEFENSA POR SEXO SEGÚN INSTITUCIÓN Y CARRERA.  (Todo el país, 2017). "]
[""]
["Cuadro II-5.2.2 ","ESTUDIANTES INGRESADOS, MATRICULADOS Y EGRESADOS EN OTRAS OFERTAS DE NIVEL TERCIARIO NO UNIVERSITARIO POR SEXO SEGÚN INSTITUCIÓN Y CARRERA.  (Todo el país, 2017). "]
[""]
[]
["Cuadro II-5.3.1","PERSONAL ACADÉMICO DE NIVEL TERCIARIO NO UNIVERSITARIO DEL ÁREA SEGURIDAD Y DEFENSA POR CARGA HORARIA, SEXO, SEGÚN INSTITUCIÓN Y FORMACIÓN.  (Todo el país, 2017). "]
[""]
["Cuadro II-5.3.2","PERSONAL ACADÉMICO DE NIVEL TERCIARIO NO UNIVERSITARIO POR CARGA HORARIA SEMANAL, SEXO, SEGÚN INSTITUCIÓN Y FORMACIÓN . (Todo el país, 2017). "]
[]
[]
[]
[]
[]
[]
[]
[]
[]
[]
[]
[]
[{"$f":"MID(B19,1,20)","v":""}]
[""]
[""]
[""]
[""]
[""]
[""]
[""]
[""]
[""]
[""]
[""]
[""]
[""]
[""]
[""]
[""]
[""]
[""]
[""]
[""]
[""]
[""]
[""]
[""]
[""]
[""]
[""]
[""]
[""]
[""]
[""]
[""]
[""]
[""]
[""]
[""]
[""]
[""]
[""]
[""]
[""]
[""]
[""]
[""]
[""]
[""]
[""]
[""]
[""]
[""]
[""]
[""]
[""]
[{"$f":"MID(B73,1,20)","v":""}]
[""]
[""]
[""]
[""]
[""]
[""]
[""]
[""]
[""]
[""]
[""]
[""]
[""]
[""]
[""]
[""]
[""]
[""]
[""]
[""]
[""]
[""]
[""]
[""]
[""]
[""]
[""]

{"sheet":"II-5.1.1  ","index":71,"n_rows":46,"n_cols":7,"rows_kept":46,"cut":false,"hidden":false,"merged":[[53,0,54,5],[0,3,1,4],[4,0,4,4],[5,0,9,0],[5,1,9,1],[5,2,5,3],[5,4,9,4],[6,2,7,3],[8,2,9,2],[8,3,9,3],[50,0,50,4]]}
["OFERTAS TERCIARIAS NO UNIVERSITARIAS",null,null,"INSTITUCIONES"]
[]
["Cuadro Nº II-5.1.1"]
[]
["MATRÍCULA Y PERSONAL DOCENTE POR SEXO SEGÚN GRANDES ÁREAS, DEPARTAMENTOS E INSTITUCIONES (Todo el país, 2017)"]
["GRANDES ÁREAS / DEPARTAMENTO / INSTITUCIÓN","TOTAL","MATRICULA",null,"DOCENTES"]
[null,null,"SEXO"]
[]
[null,null,"VARÓN","MUJER"]
[]
["TOTAL",{"$f":"+B13+B22","v":10798},{"$f":"+C13+C22","v":6379},{"$f":"+D13+D22","v":4419},{"$f":"+E13+E22","v":1676}]
[]
["MONTEVIDEO",{"$f":"+C13+D13","v":6820},{"$f":"SUM(C15:C20)","v":4071},{"$f":"SUM(D15:D20)","v":2749},{"$f":"SUM(E15:E20)","v":970}]
[]
["ESCUELA NAVAL",{"$f":"C15+D15","v":123},98,25,132,null,{"$f":"F13:I18","v":0}]
["ESCUELA NACIONAL DE POLICÍA",{"$f":"C16+D16","v":213},162,51,56]
["ESCUELA MILITAR",165,145,20,25]
["ESCUELA MILITAR DE AERONÁUTICA",65,53,12,52]
["EMAD",207,61,146,49]
["UTU",{"$f":"C20+D20","v":6047},3552,2495,656]
[]
["RESTO DEL PAÍS",{"$f":"SUM(B24:B41)","v":3978},{"$f":"SUM(C24:C41)","v":2308},{"$f":"SUM(D24:D41)","v":1670},{"$f":"SUM(E24:E41)","v":706}]
[]
["Artigas",{"$f":"C24+D24","v":84},34,50,31]
["Canelones",{"$f":"C25+D25","v":382},132,250,90]
["Cerro Largo",142,79,63,33]
["Colonia",205,82,123,52]
["Durazno",63,24,39,15]
["Flores",153,98,55,14]
["Florida",127,78,49,20]
["Lavalleja",22,18,4,7]
["Maldonado",284,172,112,62]
["Paysandú",855,578,277,113]
["Río Negro",96,46,50,27]
["Rivera",{"$f":"C35+D35","v":576},309,267,73]
["Rocha",0,0,0,96]
["Salto",486,373,113,6]
["San José",83,54,29,44]
["Soriano",189,116,73,19]
["Tacuarembó",213,102,111,4]
["Treinta y Tres",18,13,5]
["Fuente: "]
["           D.E - UTU-"]
["           Secretaría General EMAD"]
["Escuela Nacional de Policía "]
["Dirección de Formación. Ministerio de Defensa Nacional"]

{"sheet":"II-5.2.1 ","index":72,"n_rows":31,"n_cols":10,"rows_kept":31,"cut":false,"hidden":false,"merged":[[7,5,7,6],[7,8,7,9],[31,0,31,9],[32,0,32,9],[0,6,1,9],[4,0,4,9],[6,0,8,0],[6,1,8,1],[6,2,6,3],[6,4,8,4],[6,5,6,6],[6,7,8,7],[6,8,6,9],[7,2,7,3]]}
["OFERTAS TERCIARIAS NO UNIVERSITARIAS DEL ÁREA SEGURIDAD Y DEFENSA",null,null,null,null,null,"ALUMNOS MATRICULADOS"]
[]
["Cuadro Nº II-5.2.1"]
[]
["ESTUDIANTES INGRESADOS, MATRICULADOS Y EGRESADOS EN NIVEL TERCIARIO NO UNIVERSITARIO DEL ÁREA SEGURIDAD Y DEFENSA POR SEXO SEGÚN INSTITUCIÓN Y CARRERA (Todo el país, 2017)"]
[]
["INSTITUCION / CARRERA","TOTAL","INGRESADOS",null,"TOTAL","MATRICULADOS",null,"TOTAL","EGRESADOS"]
[null,null,"SEXO",null,null,"SEXO",null,null,"SEXO"]
[null,null,"V","M",null,"V","M",null,"V","M"]
["TOTAL",{"$f":"D10+C10","v":353},{"$f":"+C12+C16+C19+C23","v":274},{"$f":"+D12+D16+D19+D23","v":79},{"$f":"G10+F10","v":566},{"$f":"+F12+F16+F19+F23","v":458},{"$f":"+G12+G16+G19+G23","v":108},{"$f":"J10+I10","v":201},{"$f":"+I12+I16+I19+I23","v":167},{"$f":"+J12+J16+J19+J23","v":34}]
[]
["ESCUELA NAVAL",{"$f":"SUM(B13:B14)","v":52},36,16,123,98,25,16,16,0]
["Marina de Guerra",{"$f":"SUM(C13:D13)","v":38},24,14,{"$f":"SUM(F13:G13)","v":74},53,21,{"$f":"SUM(I13:J13)","v":9},9,0]
["Marina Mercante",{"$f":"SUM(C14:D14)","v":14},12,2,{"$f":"SUM(F14:G14)","v":49},45,4,{"$f":"SUM(I14:J14)","v":7},7,0]
[]
["ESCUELA NACIONAL DE POLICÍA",{"$f":"+C16+D16","v":137},{"$f":"+C17","v":104},{"$f":"+D17","v":33},{"$f":"+F16+G16","v":213},{"$f":"+F17","v":162},{"$f":"+G17","v":51},{"$f":"+I16+J16","v":90},{"$f":"+I17","v":69},{"$f":"+J17","v":21}]
["Curso de Cadetes (1º,2º y 3er.año)",{"$f":"SUM(C17:D17)","v":137},104,33,{"$f":"SUM(F17:G17)","v":213},162,51,{"$f":"SUM(I17:J17)","v":90},69,21]
[]
["ESCUELA MILITAR",{"$f":"SUM(C19:D19)","v":99},{"$f":"C20+C21","v":81},{"$f":"D20+D21","v":18},{"$f":"SUM(F19:G19)","v":165},{"$f":"F20+F21","v":145},{"$f":"G20+G21","v":20},{"$f":"SUM(I19:J19)","v":49},{"$f":"I20+I21","v":45},{"$f":"J20+J21","v":4}]
["Alférez de Cuerpo de Comando",{"$f":"+C20+D20","v":94},78,16,{"$f":"+F20+G20","v":158},140,18,{"$f":"SUM(I20:J20)","v":49},45,4]
["Alférez de Apoyo de Servicios y Combate",{"$f":"+C21+D21","v":5},3,2,{"$f":"+F21+G21","v":7},5,2,{"$f":"SUM(I21:J21)","v":0},0,0]
[]
["ESCUELA MILITAR DE AERONÁUTICA ",{"$f":"SUM(C23:D23)","v":65},{"$f":"SUM(C24:C27)","v":53},{"$f":"SUM(D24:D27)","v":12},{"$f":"SUM(F23:G23)","v":65},{"$f":"SUM(F24:F27)","v":53},{"$f":"SUM(G24:G27)","v":12},{"$f":"SUM(I23:J23)","v":46},{"$f":"SUM(I24:I27)","v":37},{"$f":"SUM(J24:J27)","v":9}]
["Licenciatura en Defensa Militar Aeroespacial",{"$f":"+C24+D24","v":19},16,3,{"$f":"+F24+G24","v":19},16,3,{"$f":"SUM(I24:J24)","v":0},0,0]
["Cadetes de 1º",{"$f":"+C25+D25","v":18},13,5,{"$f":"+F25+G25","v":18},13,5,18,13,5]
["Cadetes de 2º",12,9,3,12,9,3,12,9,3]
["Cadetes de 3º Profesional",16,15,1,16,15,1,16,15,1]
[]
[]
["Fuentes: Escuela Nacional de Policía "]
["Dirección de Formación. Ministerio de Defensa Nacional"]

{"sheet":"II-5.2.2","index":73,"n_rows":95,"n_cols":10,"rows_kept":95,"cut":false,"hidden":false,"merged":[[7,2,8,2],[7,3,8,3],[7,5,8,5],[7,6,8,6],[7,8,8,8],[7,9,8,9],[0,6,1,9],[4,0,4,9],[5,0,8,0],[5,1,8,1],[5,2,5,3],[5,4,8,4],[5,5,5,6],[5,7,8,7],[5,8,5,9],[6,2,6,3],[6,5,6,6],[6,8,6,9]]}
["OTRAS OFERTAS TERCIARIAS NO UNIVERSITARIAS",null,null,null,null,null," MATRICULADOS"]
[]
["Cuadro Nº II-5.2.2"]
[]
["ESTUDIANTES INGRESADOS, MATRICULADOS Y EGRESADOS EN OTRAS OFERTAS DE NIVEL TERCIARIO NO UNIVERSITARIO POR SEXO SEGÚN INSTITUCIÓN Y CARRERA (Todo el país, 2017)"]
["INSTITUCION / CARRERA","TOTAL","INGRESADOS",null,"TOTAL","MATRICULADOS",null,"TOTAL","EGRESADOS"]
[null,null,"SEXO",null,null,"SEXO",null,null,"SEXO"]
[null,null,"V","M",null,"V","M",null,"V","M"]
[]
["EMAD Margarita Xirgu",{"$f":"C10+D10","v":45},{"$f":"C11+C12","v":13},{"$f":"D11+D12","v":32},{"$f":"F10+G10","v":207},{"$f":"F11+F12","v":61},{"$f":"G11+G12","v":146},{"$f":"I10+J10","v":28},{"$f":"I11+I12","v":4},{"$f":"J11+J12","v":24}]
["Carrera de actuación",{"$f":"C11+D11","v":24},10,14,{"$f":"F11+G11","v":106},39,67,{"$f":"I11+J11","v":12},0,12]
["Carrera de diseño teatral",{"$f":"C12+D12","v":21},3,18,{"$f":"F12+G12","v":101},22,79,{"$f":"I12+J12","v":16},4,12]
[]
["CETP (UTU) ","-","-","-",{"$f":"+F14+G14","v":10025},{"$f":"SUM(F15:F94)","v":5860},{"$f":"SUM(G15:G94)","v":4165},"-","-","-"]
["ADMINISTRACIÓN","-","-","-",{"$f":"+F15+G15","v":576},149,427,"-","-","-"]
["AERONÁUTICA","-","-","-",41,38,3,"-","-","-"]
["AGRÓNICA ÉNFASIS AGRÍCOLA","-","-","-",31,30,1,"-","-","-"]
["AGRÓNICA ÉNFASIS FORESTAL","-","-","-",20,19,1,"-","-","-"]
["ANALISTA EN MARKETING","-","-","-",101,46,55,"-","-","-"]
["ÁREA ELECTROTECNIA ELECTRÓNICA","-","-","-",196,184,12,"-","-","-"]
["ÁREA OPTATIVA D. GRAFICO COM.VISUAL","-","-","-",278,103,175,"-","-","-"]
["ARTICULACIÓN TECNÓLOGO QUÍMICO","-","-","-",77,25,52,"-","-","-"]
["AUDIOVISUALES","-","-","-",106,64,42,"-","-","-"]
["AUTO TRÓNICA LAB. S. DE CONTROL","-","-","-",51,51,0,"-","-","-"]
["BIOTECNOLOGÍA INDUSTRIAL","-","-","-",88,30,58,"-","-","-"]
["COM. SOCIAL OP. PRENSA","-","-","-",43,16,27,"-","-","-"]
["COM. SOCIAL OP. RADIODIFUSIÓN","-","-","-",77,35,42,"-","-","-"]
["COM. SOCIAL OP. RR.PP.","-","-","-",37,13,24,"-","-","-"]
["COM. SOCIAL OP.TELEVISION","-","-","-",38,15,23,"-","-","-"]
["COM.SOCIAL OP. PUBLICIDAD","-","-","-",40,20,20,"-","-","-"]
["COMPONENTE OPCIONAL CTT LOGÍSTICA","-","-","-",125,43,82,"-","-","-"]
["CONSERV. GESTIÓN ÁREAS NATUR","-","-","-",22,6,16,"-","-","-"]
["CONSTRUCCIÓN","-","-","-",85,70,15,"-","-","-"]
["CONSTRUCCIÓN CICLO COMÚN","-","-","-",143,110,33,"-","-","-"]
["CONSTRUCCIÓN DE OBRA CIVIL","-","-","-",36,20,16,"-","-","-"]
["CONTROL AMBIENTAL","-","-","-",298,102,196,"-","-","-"]
["CORREDOR DE SEGUROS","-","-","-",57,33,24,"-","-","-"]
["D. I. T. CULTURALES S.","-","-","-",14,4,10,"-","-","-"]
["D. I. T. S. DE LA NATURALEZA","-","-","-",9,3,6,"-","-","-"]
["D. ITINERARIO TURÍSTICO SOSTENIBLE","-","-","-",91,29,62,"-","-","-"]
["DEPORTES NÁUTICOS","-","-","-",42,29,13,"-","-","-"]
["DISEÑO GRÁFICO EN COM. VISUAL","-","-","-",352,129,223,"-","-","-"]
["ELECTRÓNICA","-","-","-",213,205,8,"-","-","-"]
["ELECTROTECNIA","-","-","-",764,742,22,"-","-","-"]
["ENERGÍA EÓLICA","-","-","-",8,8,0,"-","-","-"]
["ENERGÍA SOLAR FOTOVOLTAICA","-","-","-",7,7,0,"-","-","-"]
["ENOLOGÍA MÓDULO ENOLÓGICO II","-","-","-",3,2,1,"-","-","-"]
["ENOLOGÍA MÓDULO VITIVINÍCOLA","-","-","-",9,5,4,"-","-","-"]
["FORESTAL","-","-","-",25,17,8,"-","-","-"]
["FORESTAL - BINACIONAL","-","-","-",19,11,8,"-","-","-"]
["GASTRONOMÍA - BINACIONAL","-","-","-",45,15,30,"-","-","-"]
["GESTIÓN DE ALOJAMIENTO","-","-","-",31,10,21,"-","-","-"]
["GESTIÓN EMPRESAS TURÍSTICAS","-","-","-",58,16,42,"-","-","-"]
["GESTIÓN EN DEPORTE Y RECREACIÓN","-","-","-",26,14,12,"-","-","-"]
["GESTIÓN HUMANA","-","-","-",270,68,202,"-","-","-"]
["INDUSTRIAS LÁCTEAS","-","-","-",53,34,19,"-","-","-"]
["INFOGRAFÍA DE ARQUITECTURA","-","-","-",79,37,42,"-","-","-"]
["INFORMÁTICA PARA INTERNET","-","-","-",86,61,25,"-","-","-"]
["INSTALACIONES ELÉCTRICAS","-","-","-",95,94,1,"-","-","-"]
["INSTALACIONES SANITARIAS","-","-","-",14,13,1,"-","-","-"]
["INSTRUMENTACIÓN Y CONTROL","-","-","-",34,34,0,"-","-","-"]
["LOGÍSTICA","-","-","-",466,234,232,"-","-","-"]
["LOGÍSTICA - BINACIONAL","-","-","-",45,13,32,"-","-","-"]
["MANTENIMIENTO MECÁNICO INDUSTRIAL","-","-","-",87,82,5,"-","-","-"]
["MAQUINISTA NAVAL","-","-","-",164,163,1,"-","-","-"]
["MECATRÓNICA","-","-","-",32,23,9,"-","-","-"]
["MECATRÓNICA - AUTOM. Y CONTROL","-","-","-",9,9,0,"-","-","-"]
["MECATRÓNICA - INT. AUT. Y CONTROL","-","-","-",4,4,0,"-","-","-"]
["MECATRÓNICA - MANT. ELECTROMECÁNICO","-","-","-",7,7,0,"-","-","-"]
["MOTORES DE COMBUSTIÓN INTERNA","-","-","-",39,39,0,"-","-","-"]
["OPERADOR INMOBILIARIO","-","-","-",89,57,32,"-","-","-"]
["ÓPTICO","-","-","-",97,45,52,"-","-","-"]
["ORGANIZACIÓN DE EVENTOS","-","-","-",77,17,60,"-","-","-"]
["PREVENCIONISTA","-","-","-",1230,660,570,"-","-","-"]
["PREVENCIONISTA  SEMIPRESENCIAL","-","-","-",344,155,189,"-","-","-"]
["PREVENCIONISTA EN SEG.INDUSTRIAL","-","-","-",155,85,70,"-","-","-"]
["PRODUCCIÓN AGRÍCOLA GANADERA","-","-","-",310,221,89,"-","-","-"]
["PRODUCCIÓN AGROPECUARIA FAMILIAR","-","-","-",18,5,13,"-","-","-"]
["PRODUCTOS EN GEMAS","-","-","-",{"$f":"+F79+G79","v":8},1,7,"-","-","-"]
["RECREACIÓN","-","-","-",273,108,165,"-","-","-"]
["REDES Y COMUNICACIONES ÓPTICAS","-","-","-",46,37,9,"-","-","-"]
["REDES Y SOFTWARE","-","-","-",205,185,20,"-","-","-"]
["REMATADOR","-","-","-",81,49,32,"-","-","-"]
["REMATADOR - OP. INMOBILIARIO","-","-","-",139,86,53,"-","-","-"]
["S. P. ARROZ PASTURAS - BINACIONAL","-","-","-",16,7,9,"-","-","-"]
["SECRETARIADO BILINGÜE - INGLES","-","-","-",31,7,24,"-","-","-"]
["SISTEMAS ENERGÍAS RENOVABLES","-","-","-",73,39,34,"-","-","-"]
["TÉCNICO EN COMUNICACIÓN SOCIAL","-","-","-",311,138,173,"-","-","-"]
["TECNÓLOGO CÁRNICO","-","-","-",45,28,17,"-","-","-"]
["TECNÓLOGO EN INFORMÁTICA","-","-","-",428,371,57,"-","-","-"]
["TECNÓLOGO MADERA",null,null,null,59,39,20]
["TECNÓLOGO MECÁNICO",null,null,null,57,55,2]
["TECNÓLOGO QUÍMICO",null,null,null,118,36,82]
["TELECOMUNICACIONES",null,null,null,49,46,3]
["           Secretaría General EMAD",null,null,null,0]

{"sheet":"II-5.3.1 ","index":74,"n_rows":38,"n_cols":11,"rows_kept":38,"cut":false,"hidden":false,"merged":[[42,0,42,10],[0,4,1,6],[4,0,4,10],[5,0,8,0],[5,1,8,1],[5,2,5,10],[6,2,8,2],[6,3,6,4],[6,5,8,5],[6,6,6,7],[6,8,8,8],[6,9,6,10],[7,3,7,4],[7,6,7,7],[7,9,7,10],[41,0,41,10]]}
["OFERTAS TERCIARIAS NO UNIVERSITARIAS DEL ÁREA SEGURIDAD Y DEFENSA",null,null,null,"PERSONAL ACADÉMICO"]
[]
["Cuadro Nº II-5.3.1"]
[]
["PERSONAL ACADÉMICO DE NIVEL TERCIARIO NO UNIVERSITARIO DEL ÁREA SEGURIDAD Y DEFENSA POR CARGA HORARIA, SEXO, SEGÚN INSTITUCIÓN Y FORMACIÓN (Todo el país, 2017)"]
["INSTITUCIONES / FORMACIÓN","TOTAL","HORAS SEMANALES"]
[null,null,"Total","20 horas o menos",null,"Total","Entre 21 y 30 horas",null,"Total","31 horas y más"]
[null,null,null,"SEXO",null,null,"SEXO",null,null,"SEXO"]
[null,null,null,"V","M",null,"V","M",null,"V","M"]
["TOTAL",{"$f":"C10+F10+I10","v":265},{"$f":"D10+E10","v":261},{"$f":"D12+D18+D24+D30","v":206},{"$f":"E12+E18+E24+E30","v":55},{"$f":"G10+H10","v":4},{"$f":"G12+G18+G24+G30","v":0},{"$f":"H12+H18+H24+H30","v":4},{"$f":"J10+K10","v":0},{"$f":"J12+J18+J24+J30","v":0},{"$f":"K12+K18+K24+K30","v":0}]
[]
["ESCUELA NAVAL",{"$f":"C12+F12+I12","v":132},{"$f":"D12+E12","v":132},{"$f":"SUM(D13:D16)","v":115},{"$f":"SUM(E13:E16)","v":17},{"$f":"G12+H12","v":0},{"$f":"SUM(G13:G16)","v":0},{"$f":"SUM(H13:H16)","v":0},{"$f":"J12+K12","v":0},{"$f":"SUM(J13:J16)","v":0},{"$f":"SUM(K13:K16)","v":0}]
["  Sin formación de grado completa",{"$f":"C13+F13+I13","v":0},{"$f":"D13+E13","v":0},0,0,{"$f":"G13+H13","v":0},0,0,{"$f":"J13+K13","v":0},0,0]
["  Con formación de grado",122,{"$f":"D14+E14","v":122},112,10,{"$f":"G14+H14","v":0},0,0,{"$f":"J14+K14","v":0},0,0]
["  Con postgrado de especialización o maestría",1,{"$f":"D15+E15","v":1},1,0,0,0,0,{"$f":"J15+K15","v":0},0,0]
["  Con doctorado",9,{"$f":"D16+E16","v":9},2,7,{"$f":"G16+H16","v":0},0,0,{"$f":"J16+K16","v":0},0,0]
[]
["ESCUELA NACIONAL DE POLICÍA",{"$f":"C18+F18+I18","v":56},{"$f":"D18+E18","v":56},{"$f":"SUM(D19:D22)","v":44},{"$f":"SUM(E19:E22)","v":12},{"$f":"G18+H18","v":0},{"$f":"SUM(G19:G22)","v":0},{"$f":"SUM(H19:H22)","v":0},{"$f":"J18+K18","v":0},{"$f":"SUM(J19:J22)","v":0},{"$f":"SUM(K19:K22)","v":0}]
["  Sin formación de grado completa",{"$f":"C19+F19+I19","v":0},{"$f":"D19+E19","v":0},0,0,{"$f":"G19+H19","v":0},0,0,{"$f":"J19+K19","v":0},0,0]
["  Con formación de grado",{"$f":"C20+F20+I20","v":52},{"$f":"D20+E20","v":52},40,12,{"$f":"G20+H20","v":0},0,0,{"$f":"J20+K20","v":0},0,0]
["  Con postgrado de especialización o maestría",{"$f":"C21+F21+I21","v":1},{"$f":"D21+E21","v":1},1,0,{"$f":"G21+H21","v":0},0,0,{"$f":"J21+K21","v":0},0,0]
["  Con doctorado",{"$f":"C22+F22+I22","v":3},{"$f":"D22+E22","v":3},3,0,{"$f":"G22+H22","v":0},0,0,{"$f":"J22+K22","v":0},0,0]
[]
["ESCUELA MILITAR",{"$f":"C24+F24+I24","v":25},{"$f":"D24+E24","v":21},{"$f":"SUM(D25:D28)","v":9},{"$f":"SUM(E25:E28)","v":12},{"$f":"G24+H24","v":4},{"$f":"SUM(G25:G28)","v":0},{"$f":"SUM(H25:H28)","v":4},{"$f":"J24+K24","v":0},{"$f":"SUM(J25:J28)","v":0},{"$f":"SUM(K25:K28)","v":0}]
["  Sin formación de grado completa",{"$f":"C25+F25+I25","v":3},{"$f":"D25+E25","v":3},1,2,{"$f":"G25+H25","v":0},0,0,{"$f":"J25+K25","v":0},0,0]
["  Con formación de grado",{"$f":"C26+F26+I26","v":16},{"$f":"D26+E26","v":13},5,8,{"$f":"G26+H26","v":3},0,3,{"$f":"J26+K26","v":0},0,0]
["  Con postgrado de especialización o maestría",3,2,1,1,{"$f":"G27+H27","v":1},0,1,{"$f":"J27+K27","v":0},0,0]
["  Con doctorado",3,3,2,1,{"$f":"G28+H28","v":0},0,0,{"$f":"J28+K28","v":0},0,0]
[]
["ESCUELA MILITAR DE AERONÁUTICA",{"$f":"C30+F30+I30","v":52},{"$f":"D30+E30","v":52},{"$f":"SUM(D31:D34)","v":38},{"$f":"SUM(E31:E34)","v":14},{"$f":"G30+H30","v":0},{"$f":"SUM(G31:G34)","v":0},{"$f":"SUM(H31:H34)","v":0},{"$f":"J30+K30","v":0},{"$f":"SUM(J31:J34)","v":0},{"$f":"SUM(K31:K34)","v":0}]
["  Sin formación de grado completa",{"$f":"C31+F31+I31","v":0},{"$f":"D31+E31","v":0},0,0,{"$f":"G31+H31","v":0},0,0,{"$f":"J31+K31","v":0},0,0]
["  Con formación de grado",45,45,33,12,0,0,0,0,0,0]
["  Con postgrado de especialización o maestría",7,7,5,2,0,0,0,0,0,0]
["  Con doctorado",0,0,0,0,0,0,0,0,0,0]
[]
[]
["Fuentes: Escuela Nacional de Policía "]
["Dirección de Formación. Ministerio de Defensa Nacional"]

{"sheet":"II-5.3.2 ","index":75,"n_rows":16,"n_cols":11,"rows_kept":16,"cut":false,"hidden":false,"merged":[[6,9,6,10],[7,3,7,4],[7,6,7,7],[7,9,7,10],[0,2,1,4],[4,0,4,10],[5,0,8,0],[5,1,8,1],[5,2,5,10],[6,2,8,2],[6,3,6,4],[6,5,8,5],[6,6,6,7],[6,8,8,8]]}
["OTRAS OFERTAS TERCIARIAS NO UNIVERSITARIAS ",null,"PERSONAL ACADÉMICO"]
[]
["Cuadro Nº II-5.3.2"]
[]
["PERSONAL ACADÉMICO DE NIVEL TERCIARIO NO UNIVERSITARIO POR CARGA HORARIA SEMANAL, SEXO, SEGÚN INSTITUCIÓN Y FORMACIÓN (Todo el país, 2017)"]
["INSTITUCIONES / FORMACIÓN","TOTAL","HORAS SEMANALES"]
[null,null,"Total","20 horas o menos",null,"Total","Entre 21 y 30 horas",null,"Total","31 horas y más"]
[null,null,null,"SEXO",null,null,"SEXO",null,null,"SEXO"]
[null,null,null,"V","M",null,"V","M",null,"V","M"]
["EMAD Margarita Xirgu",{"$f":"C10+F10+I10","v":49},{"$f":"D10+E10","v":49},{"$f":"SUM(D11:D14)","v":25},{"$f":"SUM(E11:E14)","v":24},{"$f":"G10+H10","v":0},{"$f":"SUM(G11:G14)","v":0},{"$f":"SUM(H11:H14)","v":0},{"$f":"J10+K10","v":0},{"$f":"SUM(J11:J14)","v":0},{"$f":"SUM(K11:K14)","v":0}]
["  Sin formación de grado completa",{"$f":"C11+F11+I11","v":26},{"$f":"D11+E11","v":26},14,12,{"$f":"G11+H11","v":0},0,0,{"$f":"J11+K11","v":0},0,0]
["  Con formación de grado",{"$f":"C12+F12+I12","v":22},{"$f":"D12+E12","v":22},11,11,{"$f":"G12+H12","v":0},0,0,{"$f":"J12+K12","v":0},0,0]
["  Con postgrado de especialización o maestría",{"$f":"C13+F13+I13","v":0},0,0,0,{"$f":"G13+H13","v":0},0,0,{"$f":"J13+K13","v":0},0,0]
["  Con doctorado",1,1,0,1,{"$f":"G14+H14","v":0},0,0,{"$f":"J14+K14","v":0},0,0]
["Fuente: "]
["          Secretaría General - EMAD"]

{"sheet":"FORMACIÓN EN EDUCACIÓN  ","index":76,"n_rows":43,"n_cols":2,"rows_kept":43,"cut":false,"hidden":false,"merged":[]}
[]
[]
[]
[]
[]
[]
[]
[]
["Cuadro II-6.1.1"," MATRÍCULA Y PERSONAL DOCENTE SEGÚN GRANDES ÁREAS, DEPARTAMENTOS E INSTITUCIONES.  (Todo el país, 2017). "]
[""]
[""]
["Cuadro II-6.2.1","ESTUDIANTES INGRESADOS, MATRICULADOS Y EGRESADOS EN FORMACIÓN EN EDUCACIÓN POR CARRERA SEGÚN DEPARTAMENTO Y ESTABLECIMIENTO.  (Todo el país, 2017). "]
["Cuadro II-6.2.2 ","ESTUDIANTES INGRESADOS, MATRICULADOS Y EGRESADOS EN FORMACIÓN EN EDUCACIÓN POR SEXO SEGÚN INSTITUCIÓN Y CARRERA TERCIARIA NO UNIVERSITARIA.  (Todo el país, 2017)."]
[]
[]
[""]
["Cuadro II-6.3.1","PERSONAL DOCENTE DE LOS INSTITUTOS DE FORMACIÓN EN EDUCACIÓN Y CANTIDAD DE HORAS POR INSTITUCIÓN Y DEPARTAMENTO.  (Todo el país, 2017)."]
["Cuadro II-6.3.2","PERSONAL DOCENTE DE FORMACIÓN EN EDUCACIÓN POR CARGA HORARIA SEMANAL, SEXO, SEGÚN INSTITUCIÓN Y FORMACIÓN TERCIARIA NO UNIVERSITARIA.  (Todo el país, 2017)."]
["Cuadro II-6.3.3","ESTUDIANTES INGRESADOS Y MATRICULADOS EN FORMACIÓN EN EDUCACIÓN SEGÚN ORIGEN GEOGRÁFICO.  (Todo el país, 2017)."]
[""]
[""]
[""]
[""]
[""]
[""]
[""]
[""]
[""]
[""]
[""]
[""]
[""]
[{"$f":"MID(B22,1,20)","v":""}]
[""]
[""]
[""]
[""]
[""]
[""]
[""]
[""]
[""]
[""]

{"sheet":"II-6.1.1","index":77,"n_rows":48,"n_cols":3,"rows_kept":48,"cut":false,"hidden":false,"merged":[[47,0,47,2],[40,0,46,2],[0,0,0,1],[0,2,1,3],[4,0,4,2],[5,0,9,0],[5,1,9,1],[5,2,9,2]]}
["ANEP - CONSEJO DE FORMACIÓN EN EDUCACIÓN",null,"INSTITUCIONES"]
[]
["Cuadro Nº II-6.1.1"]
[]
["MATRÍCULA Y PERSONAL DOCENTE SEGÚN GRANDES ÁREAS, DEPARTAMENTOS E INSTITUCIONES (Todo el país, 2017)"]
["GRANDES ÁREAS / DEPARTAMENTO / INSTITUCIÓN","TOTAL","DOCENTES"]
[]
[]
[]
[]
["TOTAL",{"$f":"+B13+B20","v":24150},{"$f":"+C13+C20","v":2361}]
[]
["MONTEVIDEO",{"$f":"SUM(B15:B18)","v":9181},{"$f":"SUM(C15:C18)","v":697}]
[]
["IINN",2141,180]
["IPA ",5058,318]
["INET",1211,139]
["IFES",771,60]
[]
["RESTO DEL PAÍS",{"$f":"SUM(B22:B39)","v":14969},{"$f":"SUM(C22:C39)","v":1664}]
[]
["Artigas",615,50]
["Canelones",2868,277]
["Cerro Largo",841,59]
["Colonia",1009,146]
["Durazno",407,43]
["Flores",197,34]
["Florida",746,143]
["Lavalleja",338,41]
["Maldonado ",1266,136]
["Paysandú",888,106]
["Río Negro",228,28]
["Rivera",1411,143]
["Rocha",516,44]
["Salto",1426,199]
["San José",368,39]
["Soriano",343,42]
["Tacuarembó",927,73]
["Treinta y Tres",575,61]
["Fuente: División Estudiantil del CFE"]
["Notas: 1) Matrícula considerada como el número de personas inscriptas  para cursar al menos una materia de las carreras que se ofrecen en el CFE.                                                                                                                          2) A partir del año 2016, los estudiantes de Educador Social del IPA, pasan al nuevo Instutito de Formación en Educación Social (IFES)"]
[]
[]
[]
[]
[]
[]
["3) Como docente se contabilizó a aquellos con horas de clase asignadas"]

{"sheet":"II-6.2.1","index":78,"n_rows":60,"n_cols":17,"rows_kept":60,"cut":false,"hidden":false,"merged":[[55,0,55,9],[8,12,9,12],[8,13,9,13],[8,14,9,14],[8,15,9,15],[8,16,9,16],[6,14,7,16],[8,2,9,2],[8,3,9,3],[8,4,9,4],[8,5,9,5],[8,6,9,6],[8,7,9,7],[8,8,9,8],[8,9,9,9],[8,10,9,10],[0,0,0,2],[0,8,1,10],[4,0,4,9],[5,0,9,1],[5,2,7,4],[5,5,5,13],[6,5,7,7],[6,8,7,10],[6,11,7,13],[8,11,9,11]]}
["ANEP - CONSEJO DE FORMACIÓN EN EDUCACIÓN",null,null,null,null,null,null,null,"MATRICULADOS"]
[]
["Cuadro Nº II-6.2.1"]
[]
["ESTUDIANTES INGRESADOS, MATRICULADOS Y EGRESADOS EN FORMACIÓN EN EDUCACIÓN POR CARRERA SEGÚN DEPARTAMENTO Y ESTABLECIMIENTO                           (Todo el país, 2017)"]
["DEPARTAMENTO / ESTABLECIMIENTO",null,"TOTAL",null,null,"CARRERA"]
[null,null,null,null,null,"Magisterio",null,null,"Profesorado",null,null,"Educador Social",null,null,"Asistente técnico en Primera Infancia"]
[]
[null,null,"Ingr.","Matr.","Egr.","Ingr.","Matr.","Egr.","Ingr.","Matr.","Egr.","Ingr.","Matr.","Egr.","Ingr.","Matr.","Egr."]
[]
["TOTAL",null,{"$f":"SUM(C14:C19)","v":8165},{"$f":"G11+J11+M11+P11","v":24150},{"$f":"E13+E19","v":1773},{"$f":"+F13+F19","v":2737},{"$f":"+G13+G19","v":7579},{"$f":"H13+H19","v":712},{"$f":"+I13+I19","v":4915},{"$f":"+J13+J19","v":14521},{"$f":"K13+K19","v":786},{"$f":"+L13+L19","v":513},{"$f":"+M13+M19","v":1516},{"$f":"N13+N19","v":18},{"$f":"+O13+O19","v":0},{"$f":"+P13+P19","v":534},{"$f":"Q13+Q19","v":257}]
[]
["MONTEVIDEO",null,{"$f":"F13+I13+L13+O13","v":2978},{"$f":"G13+J13+M13+P13","v":9181},{"$f":"H13+K13+N13+Q13","v":462},{"$f":"SUM(F14:F18)","v":648},2024,{"$f":"SUM(H14:H18)","v":91},2061,6269,{"$f":"SUM(K14:K18)","v":306},269,771,{"$f":"SUM(N14:N18)","v":4},{"$f":"SUM(O14:O17)","v":0},{"$f":"SUM(P14:P18)","v":117},61]
["                  IINN",null,{"$f":"F14+I14+L14","v":648},{"$f":"G14+J14+M14+P14","v":2141},{"$f":"H14+K14+N14+Q13","v":159},648,2024,78,"N/C","N/C",20,"N/C","N/C","N/C","N/C",117,61]
["                  IPA ",null,{"$f":"F15+I15+L15","v":1636},5058,{"$f":"H15+K15+N15+Q15","v":243},"N/C","N/C","N/C",1636,5058,243,"N/C","N/C","N/C","N/C","N/C","N/C"]
["                  UM",null,{"$f":"F16+I16+L16","v":0},0,25,"S/D","S/D",12,"S/D","S/D",13,"N/C","N/C","N/C","N/C","N/C","N/C"]
["                  INET ",null,{"$f":"F17+I17+L17","v":425},1211,30,"N/C","N/C","N/C",425,1211,30,"N/C","N/C","N/C","N/C","N/C","N/C"]
["   IFES",null,{"$f":"F18+I18+L18","v":269},771,5,"N/C","N/C",1,"N/C","N/C",0,269,771,4,"N/C","N/C","N/C"]
["RESTO DEL PAÍS",null,{"$f":"C20+C21+C28+C29+C34+C33+C35+C38+C39+C42+C43+C44+C47+C48+C51+C52+C53+C54","v":5187},{"$f":"D20+D21+D28+D29+D34+D33+D35+D38+D39+D42+D43+D44+D47+D48+D51+D52+D53+D54","v":14969},{"$f":"H19+K19+N19+Q19","v":1311},{"$f":"F20+F21+F28+F29+F34+F33+F35+F38+F39+F42+F43+F44+F47+F48+F51+F52+F53+F54","v":2089},5555,621,2854,8252,480,244,745,14,0,417,196]
["Artigas         Artigas",null,{"$f":"F20+I20+L20+O20","v":266},{"$f":"G20+J20+M20+P20","v":615},49,159,406,34,107,209,7,"S/D","S/D",8,"S/D","S/D","S/D"]
["Canelones",null,{"$f":"F21+I21+L21+O21","v":934},2868,null,{"$f":"SUM(F22:F27)","v":428},{"$f":"SUM(G22:G27)","v":1095},{"$f":"SUM(H22:H27)","v":121},{"$f":"SUM(I22:I27)","v":458},{"$f":"SUM(J22:J27)","v":1460},{"$f":"K22+K23+K24+K25+K26+K27","v":71},{"$f":"L22+L23+L24+L25+L26+L27","v":48},{"$f":"M22","v":153},{"$f":"N22","v":1},"S/D",{"$f":"SUM(P22:P27)","v":160},{"$f":"SUM(Q22:Q27)","v":40}]
["                  Canelones ",null,{"$f":"F22+I22+L22+O22","v":223},699,{"$f":"H22+K22+N22+Q22","v":49},74,247,36,101,299,12,48,153,1,"S/D","S/D","S/D"]
["                  De la Costa ",null,247,764,{"$f":"H23+K23+N23+Q23","v":42},169,356,22,78,294,7,"S/D","S/D","S/D","S/D",114,13]
["                  Pando",null,258,673,{"$f":"H24+K24+N24+Q24","v":67},161,378,35,97,249,9,"S/D","S/D","S/D","S/D",46,23]
["                  San Ramón ",null,52,216,{"$f":"H25+K25+N25+Q25","v":19},24,114,19,28,102,0,"S/D","S/D","S/D","S/D","S/D","S/D"]
["                  María Auxiliadora",null,0,0,"S/D",null,null,9,null,null,0,null,null,null,null,null,4]
["      Cerp Sur- Atlántida",null,154,516,43,"N/C","N/C","N/C",154,516,43,"S/D","S/D","S/D","S/D","S/D","S/D"]
["Cerro Largo     Melo",null,288,841,{"$f":"H28+K28+N28+Q28","v":56},80,283,40,208,558,16,"S/D","S/D","S/D","S/D","S/D","S/D"]
["Colonia",null,{"$f":"F29+I29+L29+O29","v":362},1009,"N/C",{"$f":"SUM(F30:F32)","v":143},{"$f":"SUM(G30:G32)","v":302},{"$f":"H30+H31+H32","v":27},{"$f":"I30+I31+I32","v":219},{"$f":"SUM(J30:J32)","v":707},{"$f":"K30+K31+K32","v":35},"S/D","S/D","S/D","S/D","S/D","S/D"]
["                Colonia",null,{"$f":"F30+I30+L30+O30","v":123},392,{"$f":"H30+K30+M30+N30+Q30","v":28},"N/C","N/C","N/C",123,392,28,"S/D","S/D","S/D","S/D","S/D","S/D"]
["                Carmelo",null,79,338,{"$f":"H31+K31+N31+Q31","v":16},23,111,12,56,227,4,"S/D","S/D","S/D","S/D","S/D","S/D"]
["                Rosario",null,160,279,{"$f":"H32+K32+N32+Q32","v":18},120,191,15,40,88,3,"S/D","S/D","S/D","S/D","S/D","S/D"]
["Durazno   Durazno ",null,136,407,{"$f":"H33+K33+N33+Q33","v":25},61,203,20,75,204,5,"S/D","S/D","S/D","S/D","S/D","S/D"]
["Flores       Trinidad",null,80,197,10,26,70,9,54,127,1,"S/D","S/D","S/D","S/D","S/D","S/D"]
["Florida         ",null,{"$f":"F35+I35+L35+O35","v":263},746,"N/C",{"$f":"SUM(F36:F37)","v":109},{"$f":"SUM(G36:G37)","v":276},{"$f":"SUM(H36:H37)","v":37},{"$f":"I36+I37","v":154},{"$f":"J36+J37","v":437},{"$f":"K36+K37","v":49},"S/D","S/D","S/D","S/D",{"$f":"P36+P37","v":33},{"$f":"Q36+Q37","v":33}]
["                Florida",null,109,321,77,109,276,37,"S/D",12,7,"S/D","S/D","S/D","S/D",33,33]
["                Cerp Centro - Florida",null,154,425,42,"N/C","N/C","N/C",154,425,42,"S/D","S/D","S/D","S/D","S/D","S/D"]
["Lavalleja       Minas",null,103,338,41,59,170,35,44,168,6,"S/D","S/D","S/D","S/D","S/D","S/D"]
["Maldonado   ",null,{"$f":"F39+I39+L39+O39","v":421},1266,"N/C",{"$f":"SUM(F40:F41)","v":103},{"$f":"SUM(G40:G41)","v":366},{"$f":"SUM(H40:H41)","v":52},{"$f":"SUM(I40:I41)","v":265},{"$f":"J40+J41","v":722},{"$f":"K40+K41","v":60},{"$f":"L40+L41","v":53},{"$f":"M41","v":178},{"$f":"N40+N41","v":2},"S/D","S/D","S/D"]
["                 Maldonado",null,110,385,{"$f":"H40+K40+M40+Q40","v":54},103,366,52,7,19,2,"S/D","S/D",0,"S/D","S/D","S/D"]
["                 Cerp Este",null,311,881,{"$f":"H41+K41+N41+Q41","v":60},"N/C","N/C","N/C",258,703,58,53,178,2,"S/D","S/D","S/D"]
["Paysandú     Paysandú",null,337,888,105,205,447,44,93,241,20,39,134,3,"S/D",66,38]
["Río Negro     Fray Bentos",null,77,228,17,24,79,13,53,149,4,"S/D","S/D","S/D","S/D","S/D","S/D"]
["Rivera",null,486,1411,"N/C",{"$f":"SUM(F45:F46)","v":94},{"$f":"SUM(G45:G46)","v":332},{"$f":"SUM(H45:H46)","v":47},{"$f":"SUM(I45:I46)","v":288},{"$f":"J45+J46","v":848},{"$f":"K45+K46","v":75},{"$f":"L45+L46","v":104},{"$f":"M45+M46","v":231},"S/D","S/D","S/D","S/D"]
["                  Rivera",null,251,702,53,94,332,47,53,139,6,104,231,"S/D","S/D","S/D","S/D"]
["                  Cerp Norte",null,235,709,69,"N/C","N/C","N/C",235,709,69,"S/D","S/D","S/D","S/D","S/D","S/D"]
["Rocha          Rocha",null,182,516,56,96,194,12,86,264,10,"S/D","S/D","S/D","S/D",58,34]
["Salto ",null,536,1426,"N/C",{"$f":"SUM(F49:F50)","v":180},{"$f":"SUM(G49:G50)","v":516},{"$f":"SUM(H49:H50)","v":44},{"$f":"I49+I50","v":356},{"$f":"J49+J50","v":910},{"$f":"K49+K50","v":61},"S/D","S/D","S/D","S/D","S/D","S/D"]
["                  Salto ",null,181,517,{"$f":"H49+K49+N49+Q49","v":49},180,516,44,1,1,5,"S/D","S/D","S/D","S/D","S/D","S/D"]
["                  Cerp Salto",null,355,909,{"$f":"H50+K50+N50+Q50","v":56},"N/C","N/C","N/C",355,909,56,"S/D","S/D","S/D","S/D","S/D","S/D"]
["San José      San José",null,135,368,{"$f":"H51+K51+N51+Q51","v":32},53,136,21,82,232,11,"S/D","S/D","S/D","S/D","S/D","S/D"]
["Soriano        Mercedes ",null,134,343,{"$f":"H52+K52+N52+Q52","v":29},37,149,22,97,194,7,"S/D","S/D","S/D","S/D","S/D","S/D"]
["Tacuarembó      Tacuarembó ",null,304,927,99,184,337,24,120,490,24,"S/D","S/D","S/D","S/D",100,51]
["Treinta y Tres    Treinta y Tres",null,143,575,{"$f":"H54+K54+N54+Q54","v":37},48,194,19,95,332,18,"S/D",49,"S/D","S/D","S/D","S/D"]
["Fuente: Informática - DFPD "]
["Nota: No se dispone de datos de ingreso. "]
["Matrícula considerada como el número de personas inscriptas  para cursar al menos una materia de las carreras que se ofrecen en el CFE."]
["Los matriculados en Profesorado del INET corresponden tanto al profesorado de Informática como a Maestros Técnicos."]
["La categoría profesora incluye a los maestros y profesores técnicos y a las certificaciones en lenguas extranejeras "]
["El I.F.E.S. es el Instituto de Formación en Educación Social"]

{"sheet":"II-6.2.2","index":79,"n_rows":14,"n_cols":10,"rows_kept":14,"cut":false,"hidden":false,"merged":[[0,6,1,9],[4,0,4,9],[5,0,8,0],[5,1,8,1],[5,2,5,3],[5,4,8,4],[5,5,5,6],[5,7,8,7],[5,8,5,9],[6,2,6,3],[14,0,18,9],[6,5,6,6],[6,8,6,9],[7,2,8,2],[7,3,8,3],[7,5,8,5],[7,6,8,6],[7,8,8,8],[7,9,8,9]]}
["OTRAS TERCIARIAS NO UNIVERSITARIAS",null,null,null,null,null,"MATRICULADOS"]
[]
["Cuadro Nº II-6.2.2"]
[]
["ESTUDIANTES INGRESADOS, MATRICULADOS Y EGRESADOS EN FORMACIÓN EN EDUCACIÓN POR SEXO SEGÚN INSTITUCIÓN Y CARRERA (Todo el país, 2017)"]
["INSTITUCION / CARRERA","TOTAL","INGRESADOS",null,"TOTAL","MATRICULADOS",null,"TOTAL","EGRESADOS"]
[null,null,"SEXO",null,null,"SEXO",null,null,"SEXO"]
[null,null,"V","M",null,"V","M",null,"V","M"]
[]
["INAU – CENFORES",{"$f":"SUM(C10:D10)","v":110},{"$f":"+C11","v":1},{"$f":"+D11","v":109},228,2,226,18,0,18]
["Educador en Primera Infancia (0 a 3 años)",{"$f":"SUM(C11:D11)","v":110},1,109,{"$f":"SUM(F11:G11)","v":228},2,226,{"$f":"SUM(I11:J11)","v":18},0,18]
["Fuente:"]
["         CEN.FOR.ES - I.N.A.U. "]
["Nota: Se quitó C.I.E.P ya que no dictó cursos de Educación Terciaria"]

{"sheet":"II-6.3.1","index":80,"n_rows":53,"n_cols":4,"rows_kept":53,"cut":false,"hidden":false,"merged":[[0,3,1,4],[4,0,4,2],[5,0,7,0],[5,1,6,2],[52,0,52,2]]}
["ANEP - CONSEJO DE FORMACIÓN EN EDUCACIÓN",null,null,"FUNCIONARIOS"]
[]
["Cuadro Nº II-6.3.1"]
[]
["PERSONAL DOCENTE DE LOS INSTITUTOS DE FORMACIÓN EN EDUCACIÓN Y CANTIDAD DE HORAS POR INSTITUCIÓN Y DEPARTAMENTO (Todo el país, 2017)"]
["DEPARTAMENTO / ESTABLECIMIENTO"]
[]
[null,"Cantidad de  Docentes","Cantidad de  Horas"]
["TOTAL",{"$f":"B11+B17","v":2361},{"$f":"C11+C17","v":0}]
[]
["MONTEVIDEO",{"$f":"B12+B13+B14+B15","v":697},0]
["                IINN",180,"s/d"]
["                IPA ",318,"s/d"]
["                INET",139,"s/d"]
["                IFES",60,"s/d"]
[]
["RESTO DEL PAÍS",{"$f":"B18+B19+B25+B26+B30+B31+B32+B35+B36+B39+B40+B41+B44+B45+B48+B49+B50+B51","v":1664},0]
["Artigas",50,"s/d"]
["Canelones",{"$f":"SUM(B20:B24)","v":277},"s/d"]
["                IFD Canelones ",62,"s/d"]
["                IFD de la Costa ",45,"s/d"]
["                IFD Pando",65,"s/d"]
["                IFD San Ramón ",30,"s/d"]
["                CERP del Sur",75,"s/d"]
["Cerro Largo",59,"s/d"]
["Colonia",{"$f":"SUM(B27:B29)","v":146},"s/d"]
["                IFD Carmelo",33,"s/d"]
["                IFD Rosario ",35,"s/d"]
["                CERP del Suroeste",78,"s/d"]
["Durazno ",43,"s/d"]
["Flores",34,"s/d"]
["Florida",{"$f":"B33+B34","v":143},"s/d"]
["                IFD Florida",53,"s/d"]
["                CERP del Centro",90,"s/d"]
["Lavalleja",41,"s/d"]
["Maldonado ",{"$f":"B37+B38","v":136},"s/d"]
["                IFD Maldonado",44,"s/d"]
["                CERP del Centro",92,"s/d"]
["Paysandú",106,"s/d"]
["Río Negro",28,"s/d"]
["Rivera",{"$f":"B42+B43","v":143},"s/d"]
["                IFD Rivera",64,"s/d"]
["                CERP del Norte",79,"s/d"]
["Rocha",44,"s/d"]
["Salto ",{"$f":"B46+B47","v":199},"s/d"]
["                IFD Salto",53,"s/d"]
["                CERP del Litoral",146,"s/d"]
["San José",39,"s/d"]
["Soriano ",42,"s/d"]
["Tacuarembó ",73,"s/d"]
["Treinta y Tres",61,"s/d"]
["Fuente: Contralor Docente - CFE."]
["Nota: Como docente se contabilizó a aquellos con horas de clase asignadas"]

{"sheet":"II-6.3.2","index":81,"n_rows":16,"n_cols":11,"rows_kept":16,"cut":false,"hidden":false,"merged":[[6,9,6,10],[7,3,7,4],[7,6,7,7],[7,9,7,10],[0,2,1,4],[4,0,4,10],[5,0,8,0],[5,1,8,1],[5,2,5,10],[6,2,8,2],[6,3,6,4],[6,5,8,5],[6,6,6,7],[6,8,8,8]]}
["OTRAS TERCIARIAS NO UNIVERSITARIAS",null,"PERSONAL ACADÉMICO"]
[]
["Cuadro Nº II-6.3.2"]
[]
["PERSONAL DOCENTE DE FORMACIÓN EN EDUCACIÓN POR CARGA HORARIA SEMANAL, SEXO, SEGÚN INSTITUCIÓN Y FORMACIÓN                           (Todo el país, 2017)"]
["INSTITUCIONES / FORMACIÓN","TOTAL","HORAS SEMANALES"]
[null,null,"Total","20 horas o menos",null,"Total","Entre 21 y 30 horas",null,"Total","31 horas y más"]
[null,null,null,"SEXO",null,null,"SEXO",null,null,"SEXO"]
[null,null,null,"M","F",null,"M","F",null,"M","F"]
["CENFORES -INAU ",{"$f":"C10+F10+I10","v":48},{"$f":"D10+E10","v":48},{"$f":"SUM(D11:D14)","v":6},{"$f":"SUM(E11:E14)","v":42},{"$f":"G10+H10","v":0},{"$f":"SUM(G11:G14)","v":0},{"$f":"SUM(H11:H14)","v":0},{"$f":"J10+K10","v":0},{"$f":"SUM(J11:J14)","v":0},{"$f":"SUM(K11:K14)","v":0}]
["Sin formación de grado completa",{"$f":"C11+F11+I11","v":0},{"$f":"D11+E11","v":0},0,0,{"$f":"G11+H11","v":0},0,0,{"$f":"J11+K11","v":0},0,0]
["Con formación de grado (incluye formación docente)",48,{"$f":"D12+E12","v":48},6,42,{"$f":"G12+H12","v":0},0,0,{"$f":"J12+K12","v":0},0,0]
["Con posgrado de especialización o maestría",0,{"$f":"D13+E13","v":0},0,0,{"$f":"G13+H13","v":0},0,0,{"$f":"J13+K13","v":0},0,0]
["Con doctorado",0,{"$f":"D14+E14","v":0},0,0,{"$f":"G14+H14","v":0},0,0,{"$f":"J14+K14","v":0},0,0]
["Fuente:  CENFORES - INAU"]
["Nota: Se quitó C.I.E.P ya que no dictó cursos de Educación Terciaria"]

{"sheet":"II-6.3.3","index":82,"n_rows":28,"n_cols":4,"rows_kept":28,"cut":false,"hidden":false,"merged":[[0,0,0,1],[0,3,1,4],[4,0,4,2],[5,0,6,0],[5,1,6,1],[5,2,6,2]]}
["ANEP - CONSEJO DE FORMACIÓN EN EDUCACIÓN",null,null,"MATRICULADOS"]
[]
["Cuadro Nº II-6.3.3"]
[]
["ESTUDIANTES INGRESADOS Y MATRICULADOS EN FORMACIÓN EN EDUCACIÓN SEGÚN ORIGEN GEOGRÁFICO (Todo el país, 2017)"]
["DEPARTAMENTO DONDE CURSÓ EL ÚLTIMO AÑO LICEAL","ESTUDIANTES INGRESADOS","ESTUDIANTES MATRICULADOS"]
[]
["TOTAL ",{"$f":"SUM(B9:B27)","v":8165},{"$f":"SUM(C9:C27)","v":24150}]
["Montevideo",2978,9181]
["Artigas",266,615]
["Canelones",934,2868]
["Cerro Largo",288,841]
["Colonia",362,1009]
["Durazno",136,407]
["Flores",80,197]
["Florida",263,746]
["Lavalleja",103,338]
["Maldonado",421,1266]
["Paysandú",337,888]
["Río Negro",77,228]
["Rivera",486,1411]
["Rocha",182,516]
["Salto",536,1426]
["San José",135,368]
["Soriano",134,343]
["Tacuarembó",304,927]
["Treinta y Tres",143,575]
["Fuente: Institutos de Formación Docente"]

{"sheet":"EDUCACIÓN UNIVERSITARIA","index":83,"n_rows":73,"n_cols":2,"rows_kept":73,"cut":false,"hidden":false,"merged":[]}
[]
[]
[]
[]
[]
[]
[]
["Cuadro II-7.1.1","ESTUDIANTES INGRESADOS, MATRICULADOS Y EGRESADOS EN PROGRAMAS DE GRADO POR SEXO SEGÚN GRANDES ÁREAS, DEPARTAMENTO E INSTITUCIÓN.  (Todo el país, 2017). "]
["Cuadro II-7.1.2","ESTUDIANTES INGRESADOS, MATRICULADOS Y EGRESADOS EN PROGRAMAS DE POSTGRADO POR SEXO SEGÚN INSTITUCIÓN (Todo el país, 2017)."]
[]
[]
["Cuadro II-7.2.1","UNIVERSIDADES PÚBLICAS: ESTUDIANTES INGRESADOS A CARRERAS 2017 Y EGRESADOS PRELIMINARES 2017 EN PROGRAMAS DE GRADO POR SEXO,  SEGÚN SERVICIO UNIVERSITARIO Y CARRERA.  (Todo el país, 2017)."]
["Cuadro II-7.2.2","ESTUDIANTES INGRESADOS, MATRICULADOS Y EGRESADOS EN PROGRAMAS DE GRADO EN UNIVERSIDADES PRIVADAS POR SEXO SEGÚN UNIVERSIDAD Y CARRERA (Todo el país, 2017)."]
["Cuadro II-7.2.3","ESTUDIANTES INGRESADOS, MATRICULADOS Y EGRESADOS EN PROGRAMAS DE GRADO DE INSTITUTOS UNIVERSITARIOS Y OFERTAS UNIVERSITARIAS DEL ÁREA SEGURIDAD Y DEFENSA POR SEXO SEGÚN INSTITUCIÓN Y CARRERA (Todo el país, 2017)."]
["Cuadro II-7.2.4","ESTUDIANTES INGRESADOS Y MATRICULADOS DE GRADO EN UNIVERSIDADES E INSTITUTOS UNIVERSITARIOS, SEGÚN INSTITUCIÓN Y LUGAR DE ORIGEN (Todo el país, 2017)."]
["Cuadro II-7.2.5","ESTUDIANTES INGRESADOS 2017 Y EGRESADOS PRELIMINARES 2017 EN PROGRAMAS DE POSTGRADO DE LA UNIVERSIDAD DE LA REPÚBLICA POR SEXO SEGÚN SERVICIO UNIVERSITARIO Y ACREDITACIÓN  (Todo el país, 2017)."]
["Cuadro II-7.2.6","ESTUDIANTES INGRESADOS, MATRICULADOS Y EGRESADOS EN PROGRAMAS DE POSTGRADO DE UNIVERSIDADES PRIVADAS POR SEXO SEGÚN UNIVERSIDAD Y ACREDITACIÓN (Todo el país, 2017)."]
["Cuadro II-7.2.7","ESTUDIANTES INGRESADOS, MATRICULADOS Y EGRESADOS EN PROGRAMAS DE POSTGRADO DE INSTITUTOS UNIVERSITARIOS POR SEXO SEGÚN INSTITUTO UNIVERSITARIO Y ACREDITACIÓN (Todo el país, 2017)."]
["Cuadro II-7.2.8","EVOLUCIÓN DE LA MATRÍCULA DE LAS INSTITUCIONES UNIVERSITARIAS (Todo el país, 2000 – 2017)."]
[""]
["Cuadro II-7.3.1","PERSONAL DOCENTE Y NO DOCENTE DE INSTITUCIONES UNIVERSITARIAS PÚBLICAS Y PRIVADAS EXPRESADAS EN POSICIONES FUNCIONALES POR CARGA HORARIA SEMANAL SEGÚN INSTITUCIÓN, ACTIVIDAD Y SEXO (Todo el país, 2017)."]
[]
[""]
[""]
[""]
[""]
[""]
[""]
[""]
[""]
[""]
[""]
[""]
[""]
[""]
[""]
[""]
[""]
[""]
[""]
[""]
[""]
[""]
[""]
[""]
[""]
[""]
[""]
[""]
[""]
[""]
[""]
[""]
[""]
[""]
[""]
[""]
[""]
[""]
[""]
[""]
[{"$f":"MID(B50,1,20)","v":""}]
[""]
[""]
[""]
[""]
[""]
[""]
[""]
[""]
[""]
[""]
[""]

{"sheet":"II-7.1.1   ","index":84,"n_rows":69,"n_cols":10,"rows_kept":69,"cut":false,"hidden":false,"merged":[[0,3,1,5],[4,0,4,10],[5,1,7,1],[5,2,5,3],[5,4,7,4],[5,5,5,6],[5,7,7,7],[5,8,5,9],[6,2,6,3],[6,5,6,6],[68,0,68,2],[6,8,6,9],[62,0,62,6],[63,0,63,6],[64,0,64,9],[66,0,66,9],[67,0,67,9]]}
["OFERTA UNIVERSITARIA DE GRADO",null,null,"INSTITUCIONES"]
[]
["Cuadro Nº II-7.1.1"]
[]
["ESTUDIANTES INGRESADOS, MATRICULADOS Y EGRESADOS EN PROGRAMAS DE GRADO POR SEXO SEGÚN GRANDES ÁREAS, DEPARTAMENTO E INSTITUCIÓN (Todo el país, 2017)"]
["GRANDES ÁREAS / DEPARTAMENTO / INSTITUCIÓN","TOTAL","INGRESO",null,"TOTAL","MATRÍCULA ",null,"TOTAL","EGRESADOS "]
[null,null,"SEXO",null,null,"SEXO",null,null,"SEXO"]
[null,null,"V","M",null,"V","M",null,"V","M"]
["TOTAL PAÍS",{"$f":"+C9+D9","v":32665},{"$f":"+C13+C28","v":13029},{"$f":"+D13+D28","v":19636},{"$f":"+F9+G9","v":22912},{"$f":"+F13+F28","v":11668},{"$f":"+G13+G28","v":11244},{"$f":"+I9+J9","v":8825},{"$f":"+I13+I28","v":3201},{"$f":"+J13+J28","v":5624}]
["PÚBLICO",{"$f":"+C10+D10","v":28926},{"$f":"C14+C29","v":11148},{"$f":"D14+D29","v":17778},{"$f":"+F10+G10","v":721},{"$f":"F14+F29","v":498},{"$f":"G14+G29","v":223},{"$f":"+I10+J10","v":6392},{"$f":"I14+I29","v":2113},{"$f":"J14+J29","v":4279}]
["PRIVADO",3739,{"$f":"C15+C30","v":1881},{"$f":"D15+D30","v":1858},22191,{"$f":"F15+F30","v":11170},{"$f":"G15+G30","v":11021},2433,{"$f":"I15+I30","v":1088},{"$f":"J15+J30","v":1345}]
[]
["MONTEVIDEO",{"$f":"SUM(C13:D13)","v":28678},{"$f":"C14+C15","v":11295},{"$f":"D14+D15","v":17383},{"$f":"SUM(F13:G13)","v":20324},{"$f":"F14+F15","v":10393},{"$f":"G14+G15","v":9931},{"$f":"SUM(I13:J13)","v":8096},{"$f":"I14+I15","v":2952},{"$f":"J14+J15","v":5144}]
["PÚBLICO",25273,{"$f":"C16","v":9561},{"$f":"D16","v":15712},{"$f":"SUM(F14:G14)","v":0},{"$f":"F16","v":"-"},{"$f":"G16","v":"-"},5843,{"$f":"I16","v":1924},{"$f":"J16","v":3919}]
["PRIVADO",3405,{"$f":"SUM(C17:C27)","v":1734},{"$f":"SUM(D17:D27)","v":1671},20324,{"$f":"SUM(F17:F27)","v":10393},{"$f":"SUM(G17:G27)","v":9931},2253,{"$f":"SUM(I17:I27)","v":1028},{"$f":"SUM(J17:J27)","v":1225}]
["UdelaR *",{"$f":"SUM(C16:D16)","v":25273},9561,15712,"-","-","-",5843,1924,3919]
["UCUDAL",1143,504,639,{"$f":"SUM(F17:G17)","v":6175},2625,3550,722,262,460]
["Universidad ORT Uruguay",1057,579,478,7121,4097,3024,607,328,279]
["Universidad de Montevideo",369,177,192,2800,1313,1487,290,121,169]
["Universidad de la Empresa",508,326,182,3225,1801,1424,384,186,198]
["Inst Univ Asociación Cristiana de Jóvenes",157,96,61,511,359,152,185,124,61]
["Inst Metodista Univ Crandon ",1,1,0,36,4,32,0,0,0]
["Inst Univ Monseñor Mariano Soler ",13,6,7,59,50,9,4,4,0]
["Inst Univ CEDIIAP",43,3,40,100,8,92,32,0,32]
["Inst Univ CLAEH ",11,2,9,58,17,41,6,1,5]
["Inst Univ Elbio Fernández",37,0,37,64,0,64,21,0,21]
["Escuela de Formación Profesional en Comercio Exterior y Aduana",66,40,26,175,119,56,2,2,0]
["RESTO DEL PAÍS",{"$f":"+C28+D28","v":3987},{"$f":"C29+C30","v":1734},{"$f":"D29+D30","v":2253},{"$f":"+F28+G28","v":2588},{"$f":"F29+F30","v":1275},{"$f":"G29+G30","v":1313},{"$f":"+I28+J28","v":729},{"$f":"I29+I30","v":249},{"$f":"J29+J30","v":480}]
["PÚBLICO",{"$f":"C29+D29","v":3653},{"$f":"C33+C35+C37+C44+C45+C47+C49+C50+C52+C54+C57+C59+C61","v":1587},{"$f":"D33+D35+D37+D44+D45+D47+D49+D50+D52+D54+D57+D59+D61","v":2066},{"$f":"F29+G29","v":721},{"$f":"F33+F35+F37+F44+F45+F47+F49+F50+F52+F54+F57+F59+F61","v":498},{"$f":"G33+G35+G37+G44+G45+G47+G49+G50+G52+G54+G57+G59+G61","v":223},{"$f":"I29+J29","v":549},{"$f":"I33+I35+I37+I44+I45+I47+I49+I50+I52+I54+I57+I59+I61","v":189},{"$f":"J33+J35+J37+J44+J45+J47+J49+J50+J52+J54+J57+J59+J61","v":360}]
["PRIVADO",{"$f":"C30+D30","v":334},{"$f":"C32+C38+C39+C40+C41+C42+C55","v":147},{"$f":"D32+D38+D39+D40+D41+D42+D55","v":187},{"$f":"F30+G30","v":1867},{"$f":"F32+F38+F39+F40+F41+F42+F55","v":777},{"$f":"G32+G38+G39+G40+G41+G42+G55","v":1090},{"$f":"I30+J30","v":180},{"$f":"I32+I38+I39+I40+I41+I42+I55","v":60},{"$f":"J32+J38+J39+J40+J41+J42+J55","v":120}]
["Colonia",{"$f":"SUM(C31:D31)","v":84},{"$f":"C32+C33","v":34},{"$f":"D32+D33","v":50},{"$f":"SUM(F31:G31)","v":302},{"$f":"F32+F33","v":111},{"$f":"G32+G33","v":191},{"$f":"SUM(I31:J31)","v":27},{"$f":"I32+I33","v":13},{"$f":"J32+J33","v":14}]
["Universidad de la Empresa",62,26,36,254,88,166,15,4,11]
["UTEC",22,8,14,48,23,25,12,9,3]
["Durazno"]
["UTEC",163,119,44,330,252,78,16,15,1]
["Maldonado",{"$f":"SUM(C36:D36)","v":883},{"$f":"SUM(C37:C42)","v":480},{"$f":"SUM(D37:D42)","v":403},1112,{"$f":"SUM(F37:F42)","v":448},{"$f":"SUM(G37:G42)","v":664},198,{"$f":"SUM(I37:I42)","v":69},{"$f":"SUM(J37:J42)","v":129}]
["UdelaR ",711,403,308,"-","-","-",94,41,53]
["UCUDAL",43,27,16,215,115,100,11,5,6]
["Inst Univ CLAEH ",82,30,52,389,140,249,73,22,51]
["Fundación Politécnico de Punta del Este",0,0,0,35,12,23,9,0,9]
["Inst Univ Francisco de Asís ",37,10,27,434,150,284,11,1,10]
["Inst Univ Asociación Cristiana de Jóvenes",10,10,0,39,31,8,0,0,0]
["Paysandú",841,{"$f":"C44+C45","v":336},{"$f":"D44+D45","v":505},68,{"$f":"F44+F45","v":14},{"$f":"G44+G45","v":54},159,{"$f":"I44+I45","v":51},{"$f":"J44+J45","v":108}]
["UdelaR ",813,327,486,0,"-","-",155,49,106]
["UTEC",28,9,19,68,14,54,4,2,2]
["Río Negro"]
["UTEC",{"$f":"SUM(C47:D47)","v":136},106,30,222,174,48,0,0,0]
["Rivera",483,{"$f":"C49+C50","v":182},{"$f":"D49+D50","v":301},53,{"$f":"F49+F50","v":35},{"$f":"G49+G50","v":18},41,{"$f":"I49+I50","v":8},{"$f":"J49+J50","v":33}]
["UdelaR ",206,103,103,"-","-","-",41,8,33]
["UTEC",277,{"$f":"C51+C52","v":79},{"$f":"D51+D52","v":198},53,35,18,0,0,0]
["Rocha"]
["UdelaR ",277,79,198,"-","-","-",12,6,6]
["Salto",{"$f":"SUM(C53:D53)","v":875},{"$f":"C54+C55","v":289},{"$f":"D54+D55","v":586},501,{"$f":"F54+F55","v":241},{"$f":"G54+G55","v":260},246,{"$f":"I54+I55","v":76},{"$f":"J54+J55","v":170}]
["UdelaR ",775,245,530,"-","-","-",185,48,137]
["UCUDAL",100,44,56,501,241,260,61,28,33]
["San José"]
["UdelaR ",22,16,6,"-",null,"-",4,3,1]
["Tacuarembó"]
["UdelaR ",183,74,109,"-","-","-",25,7,18]
["Treinta y Tres"]
["UdelaR ",40,19,21,"-","-","-",1,1,0]
[]
["Fuente: Oficinas Productoras de cada una de las Instituciones. "]
["Nota: "]
["La expresión “Estudiantes” hace referencia a relaciones entre personas e instituciones y no al conteo de personas físicas. De manera que una persona puede ser estudiante de más de una institución o región, ostentando en cualquiera de ambas categorías inserciones múltiples y en cada caso será contada como personas diferentes."]
["Para UdelaR:"]
["Según Res. N°15 del CDC de fecha 23/10/12, se entiende por Generación de Ingreso a Carrera  a todos los estudiantes que ingresan por primera vez a una carrera terciaria y/o de grado, en un año dado. No se consideran los estudiantes que ingresan a la carrera a través de un CIO o de un ciclo básico común en años anteriores. No se incluyen los estudiantes provisorios por previas, ni los de intercambio. Se incluyen los estudiantes de cortesía diplomática."]
["* La matrícula de UdelaR corresponde al dato del VII Censo de estudiantes de grado 2012. Son 124.200 estudiantes en Montevideo (43.748 hombres y 80.452 mujeres ) y 6.741 en el Interior del país (2.272 hombres y 4.469 mujeres).  "]
["El dato de egreso 2017 de UdelaR es PRELIMINAR"]

{"sheet":"II-7.1.2 ","index":85,"n_rows":42,"n_cols":10,"rows_kept":42,"cut":false,"hidden":false,"merged":[[0,2,1,4],[4,0,4,4],[5,0,7,0],[5,1,7,1],[5,2,5,3],[5,4,7,4],[5,5,5,6],[5,7,7,7],[5,8,5,9],[6,2,6,3],[6,5,6,6],[6,8,6,9]]}
["OFERTA UNIVERSITARIA DE POSTGRADO",null,"INSTITUCIONES"]
[]
["Cuadro Nº II-7.1.2"]
[]
["ESTUDIANTES INGRESADOS, MATRICULADOS Y EGRESADOS EN PROGRAMAS DE POSTGRADO POR SEXO SEGÚN INSTITUCIÓN (Todo el país, 2017)"]
["INSTITUCIÓN","TOTAL","INGRESADOS",null,"TOTAL","MATRICULADOS ",null,"TOTAL","EGRESADOS "]
[null,null,"SEXO",null,null,"SEXO",null,null,"SEXO"]
[null,null,"V","M",null,"V","M",null,"V","M"]
["TOTAL PAIS",{"$f":"C9+D9","v":5610},{"$f":"C10+C11","v":2118},{"$f":"D10+D11","v":3492},{"$f":"F9+G9","v":13204},{"$f":"F10+F11","v":5198},{"$f":"G10+G11","v":8006},{"$f":"I9+J9","v":2749},{"$f":"I10+I11","v":1127},{"$f":"J10+J11","v":1622}]
["PÚBLICO",{"$f":"C10+D10","v":3954},{"$f":"C14+C31","v":1513},{"$f":"D14+D31","v":2441},{"$f":"F10+G10","v":7667},{"$f":"F14+F31","v":3084},{"$f":"G14+G31","v":4583},{"$f":"I10+J10","v":1943},{"$f":"I14+I31","v":853},{"$f":"J14+J31","v":1090}]
["PRIVADO",1656,{"$f":"C15+C32","v":605},{"$f":"D15+D32","v":1051},5537,{"$f":"F15+F32","v":2114},{"$f":"G15+G32","v":3423},806,{"$f":"I15+I32","v":274},{"$f":"J15+J32","v":532}]
[]
["Montevideo",5564,{"$f":"C14+C15","v":2112},{"$f":"D14+D15","v":3452},13112,{"$f":"F14+F15","v":5140},{"$f":"G14+G15","v":7972},2744,{"$f":"I14+I15","v":1124},{"$f":"J14+J15","v":1620}]
["PÚBLICO",3931,{"$f":"C16+SUM(C25:C28)","v":1512},{"$f":"D16+SUM(D25:D28)","v":2419},7639,{"$f":"F16+SUM(F25:F28)","v":3069},{"$f":"G16+SUM(G25:G28)","v":4570},1941,{"$f":"I16+SUM(I25:I28)","v":852},{"$f":"J16+SUM(J25:J28)","v":1089}]
["PRIVADO",1633,{"$f":"SUM(C17:C24)","v":600},{"$f":"SUM(D17:D24)","v":1033},5473,{"$f":"SUM(F17:F24)","v":2071},{"$f":"SUM(G17:G24)","v":3402},803,{"$f":"SUM(I17:I24)","v":272},{"$f":"SUM(J17:J24)","v":531}]
["UdelaR *",3156,1043,2113,6839,2593,4246,1565,508,1057]
["UCUDAL",616,158,458,1596,395,1201,280,52,228]
["Universidad ORT Uruguay",213,102,111,716,292,424,214,74,140]
["Universidad de Montevideo",245,115,130,1368,648,720,208,106,102]
["Universidad de la Empresa",422,184,238,1491,635,856,44,24,20]
["Inst Univ CLAEH ",102,32,70,223,75,148,49,14,35]
["Inst Univ de Postgrado en Psicoanálisis",9,1,8,32,7,25,4,1,3]
["Instituto Universitario  Centro de Estudio y Diagnóstico de las Disgnancias del Uruguay (IUCEDDU)",8,0,8,29,9,20,4,1,3]
["Inst Univ Asociación Cristiana de Jóvenes",18,8,10,18,10,8,0,0,0]
["Centro de Altos Estudios Nacionales",40,27,13,40,27,13,24,15,9]
["Escuela de Guerra Naval (ESGUE)",118,107,11,118,107,11,63,57,6]
["IPES",339,66,273,364,73,291,11,3,8]
["Escuela Naval",278,269,9,278,269,9,278,269,9]
[]
["Resto del país",46,{"$f":"C31+C32","v":6},{"$f":"D31+D32","v":40},92,{"$f":"F31+F32","v":58},{"$f":"G31+G32","v":34},5,{"$f":"I31+I32","v":3},{"$f":"J31+J32","v":2}]
["PÚBLICO",23,{"$f":"C34+C37","v":1},{"$f":"D34+D37","v":22},28,{"$f":"F34+F37","v":15},{"$f":"G34+G37","v":13},2,{"$f":"I34+I37","v":1},{"$f":"J34+J37","v":1}]
["PRIVADO",23,{"$f":"C35+C38","v":5},{"$f":"D35+D38","v":18},64,{"$f":"F35+F38","v":43},{"$f":"G35+G38","v":21},3,{"$f":"I35+I38","v":2},{"$f":"J35+J38","v":1}]
["Maldonado",0,{"$f":"C34+C35","v":0},{"$f":"D34+D35","v":0},65,{"$f":"F34+F35","v":50},{"$f":"G34+G35","v":15},2,{"$f":"I34+I35","v":1},{"$f":"J34+J35","v":1}]
["UdelaR",0,0,0,24,12,12,2,1,1]
["Inst Univ Asociación Cristiana de Jóvenes",0,0,0,41,38,3,0,0,0]
["Salto",46,{"$f":"C37+C38","v":6},{"$f":"D37+D38","v":40},27,{"$f":"F37+F38","v":8},{"$f":"G37+G38","v":19},3,{"$f":"I37+I38","v":2},{"$f":"J37+J38","v":1}]
["UdelaR",23,1,22,4,3,1,0,0,0]
["UCUDAL",23,5,18,23,5,18,3,2,1]
["Fuente: Bedelías de los Servicios Universitarios y Sistema de Gestión de Bedelías-SeCIU"]
["UdelaR:"]
["El dato de Egresos de Posgrado  2017 es PRELIMINAR"]
["* La matrícula de UdelaR corresponde al dato del VII Censo de estudiantes de grado 2012.  "]

{"sheet":"II-7.2.1 ","index":86,"n_rows":429,"n_cols":10,"rows_kept":429,"cut":false,"hidden":false,"merged":[[0,4,1,5],[4,0,4,6],[5,1,7,1],[5,2,5,3],[5,4,7,4],[5,5,5,6],[423,0,423,6],[428,0,428,6],[6,2,6,3],[6,5,6,6],[5,8,5,9],[6,8,6,9]]}
["UNIVERSIDADES PÚBLICAS: OFERTA DE GRADO",null,null,null,"ESTUDIANTES"]
[]
["Cuadro Nº II-7.2.1"]
[]
["UNIVERSIDADES PÚBLICAS: ESTUDIANTES INGRESADOS A CARRERAS 2017 Y EGRESADOS PRELIMINARES 2017 EN PROGRAMAS DE GRADO POR SEXO,  SEGÚN SERVICIO UNIVERSITARIO Y CARRERA.  (Todo el país, 2017)"]
[null,"TOTAL","INGRESADOS ",null,"TOTAL","EGRESADOS (datos preliminares) (3)",null,"TOTAL (4)","MATRICULADOS"]
["SERVICIO UNIVERSITARIO / CARRERA",null,"SEXO",null,null,"SEXO",null,null,"SEXO"]
[null,null,"V","M",null,"V","M",null,"V","M"]
[null,null,null,null,null,null,null,null,"V","M"]
["TOTAL UNIVERSIDADES PÚBLICAS",{"$f":"C10+D10","v":29770},{"$f":"C12+C31","v":11465},{"$f":"D12+D31","v":18305},{"$f":"F10+G10","v":6392},{"$f":"F12+F31","v":2113},{"$f":"G12+G31","v":4279}]
[]
["UNIVERSIDAD TECNOLÓGICA -UTEC ",{"$f":"C12+D12","v":389},{"$f":"C13+C16+C21+C22+C27","v":269},{"$f":"D13+D16+D21+D22+D27","v":120},{"$f":"F12+G12","v":32},{"$f":"F13+F16+F21+F22+F27","v":26},{"$f":"G13+G16+G21+G22+G27","v":6},{"$f":"I12+J12","v":721},{"$f":"I13+I16+I21+I22+I27","v":498},{"$f":"J13+J16+J21+J22+J27","v":223}]
["Colonia",{"$f":"C13+D13","v":22},{"$f":"C14+C15","v":8},{"$f":"D14+D15","v":14},{"$f":"F13+G13","v":12},{"$f":"F14+F15","v":9},{"$f":"G14+G15","v":3},{"$f":"I13+J13","v":48},{"$f":"I14+I15","v":23},{"$f":"J14+J15","v":25}]
["Licenciatura en Ciencia y Tecnología de Lácteos",12,4,8,4,4,0,33,16,17]
["Tecnólogo en Manejo en Sistemas de Producción Lechera",10,4,6,8,5,3,15,7,8]
["Durazno",163,{"$f":"C17+C18+C19","v":119},{"$f":"D17+D18+D19","v":44},16,{"$f":"F17+F18+F19","v":15},{"$f":"G17+G18+G19","v":1},330,{"$f":"I17+I18+I19","v":252},{"$f":"J17+J18+J19","v":78}]
["Ingeniería en Sistemas de Riego y Manejo de Efluentes",22,13,9,0,0,0,54,44,10]
["Tecnicatura en Tecnologías de la Información",96,71,25,16,15,1,190,138,52]
["Tecnólogo en Energías Renovables",45,35,10,0,0,0,86,70,16]
["Paysandú"]
["Licenciatura en Análisis Alimentario",28,9,19,4,2,2,{"$f":"I21+J21","v":68},14,54]
["Río Negro",136,{"$f":"SUM(C23:C26)","v":106},{"$f":"SUM(D23:D26)","v":30},0,{"$f":"SUM(F23:F26)","v":0},{"$f":"SUM(G23:G26)","v":0},222,{"$f":"SUM(I23:I26)","v":174},{"$f":"SUM(J23:J26)","v":48}]
["Tecnicatura en Tecnologías de la Información",81,60,21,0,0,0,106,79,27]
["Tecnólogo en Ingeniería Biomédica",14,7,7,0,0,0,25,14,11]
["Tecnólogo en Jazz y Musica Creativa",7,7,0,0,0,0,10,10,0]
["Tecnólogo en Mecatrónica  ",34,32,2,0,0,0,81,71,10]
["Rivera",40,{"$f":"C28+C29","v":27},{"$f":"D28+D29","v":13},0,{"$f":"F28+F29","v":0},{"$f":"G28+G29","v":0},53,{"$f":"I28+I29","v":35},{"$f":"J28+J29","v":18}]
["Ingeniería en Logística",15,9,6,0,0,0,21,12,9]
["Tecnólogo en Mecatrónica Industrial",25,18,7,0,0,0,32,23,9]
[]
["TOTAL UDELAR",{"$f":"SUM(C31:D31)","v":29381},{"$f":"C33+C56+C62+C71+C91+C105+C131+C139+C151+C166+C175+C185+C202+C212+C219+C228+C234+C242+C275+C293+C307+C327+C331+C338+C362+C366+C372+C375+C381++C394+C398+C402+C406+C409+C412+C416","v":11196},{"$f":"D33+D56+D62+D71+D91+D105+D131+D139+D151+D166+D175+D185+D202+D212+D219+D228+D234+D242+D275+D293+D307+D327+D331+D338+D362+D366+D372+D375+D381++D394+D398+D402+D406+D409+D412+D416","v":18185},{"$f":"SUM(F31:G31)","v":6360},{"$f":"F33+F56+F62+F71+F91+F105+F131+F139+F151+F166+F175+F185+F202+F212+F219+F228+F234+F242+F275+F293+F307+F327+F331+F338+F362+F366+F372+F375+F381++F394+F398+F402+F406+F409+F412+F416","v":2087},{"$f":"G33+G56+G62+G71+G91+G105+G131+G139+G151+G166+G175+G185+G202+G212+G219+G228+G234+G242+G275+G293+G307+G327+G331+G338+G362+G366+G372+G375+G381++G394+G398+G402+G406+G409+G412+G416","v":4273},"s/d","s/d","s/d"]
[]
["FACULTAD DE HUMANIDADES Y CIENCIAS DE LA EDUCACIÓN",{"$f":"SUM(C33:D33)","v":1458},{"$f":"C34+C46+C48+C50+C53","v":474},{"$f":"D34+D46+D48+D50+D53","v":984},{"$f":"SUM(F33:G33)","v":96},{"$f":"F34+F46+F48+F50+F53","v":27},{"$f":"G34+G46+G48+G50+G53","v":69}]
["Montevideo",{"$f":"SUM(C34:D34)","v":1373},{"$f":"SUM(C35:C45)","v":448},{"$f":"SUM(D35:D45)","v":925},69,{"$f":"SUM(F35:F45)","v":20},{"$f":"SUM(G35:G45)","v":49},"s/d","s/d","s/d"]
["Licenciado en Ciencias Antropológicas ",186,61,125,6,2,4,"s/d","s/d","s/d"]
["Licenciado en Ciencias de la Educación ",208,53,155,22,5,17,"s/d","s/d","s/d"]
["Licenciado en Historia ",154,78,76,0,0,0,"s/d","s/d","s/d"]
["Licenciado en Filosofía ",168,94,74,5,1,4,"s/d","s/d","s/d"]
["Licenciado en Letras ",228,70,158,4,3,1,"s/d","s/d","s/d"]
["Licenciado en Lingüística ",103,25,78,2,1,1,"s/d","s/d","s/d"]
["Técnico Universitario en Corrección de Estilo (Lengua Española)",309,58,251,11,2,9,"s/d","s/d","s/d"]
["Técnico Universitario en Interpretación LSU-ESP-LSU",0,0,0,4,0,4,"s/d","s/d","s/d"]
["Técnico Universitario en Museología",0,0,0,10,3,7,"s/d","s/d","s/d"]
["Técnico Universitario en Dramaturgia (1)",17,9,8,0,0,0,"s/d","s/d","s/d"]
["Licenciado en Ciencias Históricas ",0,0,0,5,3,2,"s/d","s/d","s/d"]
["Maldonado",0,{"$f":"C47","v":0},{"$f":"D47","v":0},13,{"$f":"F47","v":3},{"$f":"G47","v":10},"s/d","s/d","s/d"]
["Licenciado en Turismo ",0,0,0,{"$f":"SUM(F47:G47)","v":13},3,10,"s/d","s/d","s/d"]
["Paysandú",28,{"$f":"C49","v":5},{"$f":"D49","v":23},0,{"$f":"F49","v":0},{"$f":"G49","v":0},"s/d","s/d","s/d"]
["Técnico Universitario en Bienes Culturales ",{"$f":"SUM(C49:D49)","v":28},5,23,0,0,0,"s/d","s/d","s/d"]
["Salto",43,{"$f":"C51+C52","v":14},{"$f":"D51+D52","v":29},14,{"$f":"F51+F52","v":4},{"$f":"G51+G52","v":10},"s/d","s/d","s/d"]
["Licenciado en Turismo ",43,14,29,6,2,4,"s/d","s/d","s/d"]
["Técnico Binacional en Turismo ",0,0,0,8,2,6,"s/d","s/d","s/d"]
["Tacuarembó",14,{"$f":"C54","v":7},{"$f":"D54","v":7},0,{"$f":"F54","v":0},{"$f":"G54","v":0},"s/d","s/d","s/d"]
["Técnico Universitario en Bienes Culturales ",{"$f":"SUM(C54:D54)","v":14},7,7,0,0,0,"s/d","s/d","s/d"]
[]
["FACULTAD DE AGRONOMÍA",{"$f":"SUM(C56:D56)","v":406},{"$f":"C57+C59","v":258},{"$f":"D57+D59","v":148},{"$f":"SUM(F56:G56)","v":158},{"$f":"F57+F59","v":107},{"$f":"G57+G59","v":51},"s/d","s/d","s/d"]
["Montevideo",{"$f":"SUM(C57:D57)","v":331},{"$f":"C58","v":212},{"$f":"D58","v":119},{"$f":"SUM(F57:G57)","v":158},{"$f":"F58","v":107},{"$f":"G58","v":51},"s/d","s/d","s/d"]
["Ingeniero Agrónomo",{"$f":"SUM(C58:D58)","v":331},212,119,{"$f":"SUM(F58:G58)","v":158},107,51,"s/d","s/d","s/d"]
["Salto",75,{"$f":"C60","v":46},{"$f":"D60","v":29},0,{"$f":"F60","v":0},{"$f":"G60","v":0},"s/d","s/d","s/d"]
["Ingeniero Agrónomo ",75,46,29,0,0,0,"s/d","s/d","s/d"]
[]
["FACULTAD DE ARQUITECTURA, DISEÑO Y URBANISMO",{"$f":"SUM(C62:D62)","v":986},{"$f":"C63+C68","v":383},{"$f":"D63+D68","v":603},{"$f":"SUM(F62:G62)","v":577},{"$f":"F63+F68","v":236},{"$f":"G63+G68","v":341},"s/d","s/d","s/d"]
["Montevideo",{"$f":"SUM(C63:D63)","v":964},{"$f":"C64+C65+C66+C67","v":373},{"$f":"D64+D65+D66+D67","v":591},{"$f":"SUM(F63:G63)","v":577},{"$f":"F64+F65+F66+F67","v":236},{"$f":"G64+G65+G66+G67","v":341},"s/d","s/d","s/d"]
["Arquitecto",710,313,397,548,232,316,"s/d","s/d","s/d"]
["Licenciado en Diseño Industrial",254,60,194,0,0,0,"s/d","s/d","s/d"]
["Licenciado en Diseño Industrial perfil Producto",0,0,0,15,4,11,"s/d","s/d","s/d"]
["Licenciado en Diseño Industrial perfil Textil-Indumentaria",0,0,0,14,0,14,"s/d","s/d","s/d"]
["Salto",22,{"$f":"C69","v":10},{"$f":"D69","v":12},0,{"$f":"F69","v":0},{"$f":"G69","v":0},"s/d","s/d","s/d"]
["Licenciado en Diseño Integrado",22,10,12,0,0,0,"s/d","s/d","s/d"]
[]
["FACULTAD DE CIENCIAS ECONÓMICAS Y ADMINISTRACIÓN",{"$f":"SUM(C71:D71)","v":5063},{"$f":"C72+C83+C85+C87+C89","v":2120},{"$f":"D72+D83+D85+D87+D89","v":2943},{"$f":"SUM(F71:G71)","v":1171},{"$f":"F72+F83+F85+F87+F89","v":464},{"$f":"G72+G83+G85+G87+G89","v":707},"s/d","s/d","s/d"]
["Montevideo",{"$f":"C72+D72","v":4762},{"$f":"SUM(C73:C81)","v":2004},{"$f":"SUM(D73:D81)","v":2758},{"$f":"F72+G72","v":1143},{"$f":"SUM(F73:F81)","v":452},{"$f":"SUM(G73:G81)","v":691},"s/d","s/d","s/d"]
["Contador Público ",{"$f":"C73+D73","v":1913},828,1085,{"$f":"F73+G73","v":843},331,512,"s/d","s/d","s/d"]
["Licenciado en Economía ",566,314,252,{"$f":"SUM(F74:G74)","v":122},63,59,"s/d","s/d","s/d"]
["Licenciado en Administración ",948,383,565,{"$f":"SUM(F75:G75)","v":84},28,56,"s/d","s/d","s/d"]
["Técnico en Administración",1313,473,840,23,5,18,"s/d","s/d","s/d"]
["Licenciado en Administración - Contador ",0,0,0,1,1,0,"s/d","s/d","s/d"]
["Técnico en Gestión Universitaria",22,6,16,0,0,0,"s/d","s/d","s/d"]
["Técnico en Administración de Empresas",0,0,0,1,1,0,"s/d","s/d","s/d"]
["Técnico Universitario en Administración",0,0,0,63,20,43,"s/d","s/d","s/d"]
["Licenciado en Estadística ",0,0,0,6,3,3,"s/d","s/d","s/d"]
["Maldonado",null,null,null,null,null,null,"s/d","s/d","s/d"]
["Tecnólogo en Administración y Contabilidad ",157,68,89,18,7,11,"s/d","s/d","s/d"]
["Rocha"]
["Tecnólogo en Administración y Contabilidad ",49,15,34,1,1,0,"s/d","s/d","s/d"]
["Tacuarembó"]
["Tecnólogo en Administración y Contabilidad ",65,23,42,9,4,5,"s/d","s/d","s/d"]
["Treinta y Tres"]
["Tecnólogo en Administración y Contabilidad ",30,10,20,0,0,0,"s/d","s/d","s/d"]
[]
["FACULTAD DE DERECHO",2948,{"$f":"+C92+C100","v":953},{"$f":"+D92+D100","v":1995},921,{"$f":"+F92+F100","v":203},{"$f":"+G92+G100","v":718},"s/d","s/d","s/d"]
["Montevideo",2825,{"$f":"SUM(C93:C99)","v":914},{"$f":"SUM(D93:D99)","v":1911},889,{"$f":"SUM(F93:F99)","v":196},{"$f":"SUM(G93:G99)","v":693},"s/d","s/d","s/d"]
["Doctor en Derecho ",6,5,1,368,93,275,"s/d","s/d","s/d"]
["Doctor en Derecho - Escribano Público (*)",1484,495,989,0,0,0,"s/d","s/d","s/d"]
["Escribano Público",1,1,0,267,53,214,"s/d","s/d","s/d"]
["Licenciado en Relaciones Internacionales",658,269,389,87,22,65,"s/d","s/d","s/d"]
["Traductor Público",46,9,37,26,4,22,"s/d","s/d","s/d"]
["Licenciado en Relaciones Laborales",630,135,495,134,23,111,"s/d","s/d","s/d"]
["Técnico en Relaciones Laborales",0,0,0,7,1,6,"s/d","s/d","s/d"]
["Salto",123,{"$f":"SUM(C101:C103)","v":39},{"$f":"SUM(D101:D103)","v":84},32,{"$f":"SUM(F101:F103)","v":7},{"$f":"SUM(G101:G103)","v":25},"s/d","s/d","s/d"]
["Doctor en Derecho - Escribano Público (*)",123,39,84,0,0,0,"s/d","s/d","s/d"]
["Escribano Público",0,0,0,20,5,15,"s/d","s/d","s/d"]
["Doctor en Derecho  ",0,0,0,12,2,10,"s/d","s/d","s/d"]
[]
["FACULTAD DE INGENIERÍA",{"$f":"SUM(C105:D105)","v":2054},{"$f":"+C106+C119+C120+C124+C125+C129","v":1623},{"$f":"+D106+D119+D120+D124+D125+D129","v":431},{"$f":"SUM(F105:G105)","v":355},{"$f":"+F106+F119+F120+F124+F125+F129","v":294},{"$f":"+G106+G119+G120+G124+G125+G129","v":61},"s/d","s/d","s/d"]
["Montevideo",1877,{"$f":"SUM(C107:C117)","v":1481},{"$f":"SUM(D107:D117)","v":396},335,{"$f":"SUM(F107:F117)","v":276},{"$f":"SUM(G107:G117)","v":59},"s/d","s/d","s/d"]
["Ingeniero Agrimensor",39,25,14,6,6,0,"s/d","s/d","s/d"]
["Ingeniero Civil",259,171,88,62,38,24,"s/d","s/d","s/d"]
["Ingeniero de Producción ",96,51,45,{"$f":"SUM(F109:G109)","v":9},6,3,"s/d","s/d","s/d"]
["Ingeniero Eléctrico",218,164,54,51,41,10,"s/d","s/d","s/d"]
["Ingeniero en Computación",728,629,99,117,108,9,"s/d","s/d","s/d"]
["Ingeniero Industrial Mecánico",242,192,50,43,37,6,"s/d","s/d","s/d"]
["Ingeniero Naval",21,18,3,0,0,0,"s/d","s/d","s/d"]
["Licenciado en  Ingeniería Biológica",28,13,15,0,0,0,"s/d","s/d","s/d"]
["Licenciado en Computación",2,2,0,5,5,0,"s/d","s/d","s/d"]
["Tecnólogo en Informática (2)",153,134,19,27,21,6,"s/d","s/d","s/d"]
["Tecnólogo Mecánico  (2)",91,82,9,15,14,1,"s/d","s/d","s/d"]
["Maldonado"]
["Tecnólogo en Informática   (2)",32,28,4,{"$f":"SUM(F119:G119)","v":8},7,1,"s/d","s/d","s/d"]
["Paysandú",65,{"$f":"C121+C122","v":57},{"$f":"D121+D122","v":8},4,{"$f":"F121+F122","v":4},{"$f":"G121+G122","v":0},"s/d","s/d","s/d"]
["Tecnólogo en Informática   (2)",45,38,7,3,3,0,"s/d","s/d","s/d"]
["Tecnólogo Mecánico   (2)",20,19,1,1,1,0,"s/d","s/d","s/d"]
["Rocha"]
["Tecnólogo en Telecomunicaciones ",25,24,1,{"$f":"SUM(F124:G124)","v":4},4,0,"s/d","s/d","s/d"]
["Salto",33,{"$f":"C126+C127","v":17},{"$f":"D126+D127","v":16},0,{"$f":"F126+F127","v":0},{"$f":"G126+G127","v":0},"s/d","s/d","s/d"]
["Licenciado en Ciencias Hídricas Aplicadas ",19,7,12,0,0,0,"s/d","s/d","s/d"]
["Licenciado en  Ingeniería Biológica",14,10,4,0,0,0,"s/d","s/d","s/d"]
["San José"]
["Tecnólogo en Informática  (2)",22,16,6,4,3,1,"s/d","s/d","s/d"]
[]
["FACULTAD DE MEDICINA",{"$f":"SUM(C131:D131)","v":1961},{"$f":"SUM(C133+C135+C137)","v":618},{"$f":"SUM(D133+D135+D137)","v":1343},{"$f":"SUM(F131:G131)","v":399},{"$f":"SUM(F133+F135+F137)","v":110},{"$f":"SUM(G133+G135+G137)","v":289},"s/d","s/d","s/d"]
["Montevideo"]
["Doctor en Medicina",{"$f":"SUM(C133:D133)","v":1961},618,1343,{"$f":"SUM(F133:G133)","v":393},108,285,"s/d","s/d","s/d"]
["Paysandú"]
["Doctor en Medicina",{"$f":"SUM(C135:D135)","v":0},0,0,3,1,2,"s/d","s/d","s/d"]
["Salto"]
["Doctor en Medicina",{"$f":"SUM(C137:D137)","v":0},0,0,3,1,2,"s/d","s/d","s/d"]
[]
["FACULTAD DE ODONTOLOGÍA ",{"$f":"SUM(C139:D139)","v":548},{"$f":"C140+C146+C147","v":104},{"$f":"D140+D146+D147","v":444},{"$f":"SUM(F139:G139)","v":215},{"$f":"F140+F146+F147","v":26},{"$f":"G140+G146+G147","v":189},"s/d","s/d","s/d"]
["Montevideo",507,{"$f":" SUM(C141:C144)","v":98},{"$f":" SUM(D141:D144)","v":409},{"$f":"SUM(F140:G140)","v":197},{"$f":" SUM(F141:F144)","v":20},{"$f":" SUM(G141:G144)","v":177},"s/d","s/d","s/d"]
["Doctor en Odontología",264,50,214,70,12,58,"s/d","s/d","s/d"]
["Laboratorista en Odontología",65,18,47,32,4,28,"s/d","s/d","s/d"]
["Asistente en Odontología",102,17,85,44,1,43,"s/d","s/d","s/d"]
["Higienista en Odontología",76,13,63,51,3,48,"s/d","s/d","s/d"]
["Rivera"]
["Higienista en Odontología ",0,0,0,1,0,1,"s/d","s/d","s/d"]
["Salto",41,{"$f":"C148+C149","v":6},{"$f":"D148+D149","v":35},17,{"$f":"F148+F149","v":6},{"$f":"G148+G149","v":11},"s/d","s/d","s/d"]
["Asistente en Odontología ",18,3,15,7,2,5,"s/d","s/d","s/d"]
["Higienista en Odontología",23,3,20,10,4,6,"s/d","s/d","s/d"]
[]
["FACULTAD DE QUÍMICA",{"$f":"SUM(C151:D151)","v":476},{"$f":"+C152+C160+C161","v":147},{"$f":"+D152+D160+D161","v":329},{"$f":"SUM(F151:G151)","v":142},{"$f":"+F152+F160+F161","v":29},{"$f":"+G152+G160+G161","v":113},"s/d","s/d","s/d"]
["Montevideo",{"$f":"SUM(C152:D152)","v":437},{"$f":"SUM(C153:C158)","v":133},{"$f":"SUM(D153:D158)","v":304},131,{"$f":"SUM(F153:F158)","v":28},{"$f":"SUM(G153:G158)","v":103},"s/d","s/d","s/d"]
["Bioquímico Clínico",{"$f":"SUM(C153:D153)","v":106},25,81,18,3,15,"s/d","s/d","s/d"]
["Químico",48,21,27,22,6,16,"s/d","s/d","s/d"]
["Químico Farmacéutico ",181,55,126,55,8,47,"s/d","s/d","s/d"]
["Licenciado en Química",21,7,14,13,6,7,"s/d","s/d","s/d"]
["Técnico Bachiller en Cs. Químicas",12,3,9,5,3,2,"s/d","s/d","s/d"]
["Tecnólogo Químico (2)",69,22,47,18,2,16,"s/d","s/d","s/d"]
["Paysandú"]
["Tecnólogo Químico (2)",15,6,9,11,1,10,"s/d","s/d","s/d"]
["Salto",24,{"$f":"C162+C163+C164","v":8},{"$f":"D162+D163+D164","v":16},0,{"$f":"F162+F163+F164","v":0},{"$f":"G162+G163+G164","v":0},"s/d","s/d","s/d"]
["Bioquímico Clínico ",6,4,2,0,0,0,"s/d","s/d","s/d"]
["Químico ",14,4,10,0,0,0,"s/d","s/d","s/d"]
["Químico Farmacéutico ",3,0,4,0,0,0,"s/d","s/d","s/d"]
[]
["FACULTAD DE VETERINARIA ",{"$f":"SUM(C166:D166)","v":650},{"$f":"C167+C171+C173","v":189},{"$f":"D167+D171+D173","v":461},{"$f":"SUM(F166:G166)","v":157},{"$f":"F167+F171+F173","v":78},{"$f":"G167+G171+G173","v":79},"s/d","s/d","s/d"]
["Montevideo",{"$f":"SUM(C167:D167)","v":536},{"$f":"C168+C169","v":149},{"$f":"D168+D169","v":387},{"$f":"SUM(F167:G167)","v":128},{"$f":"F168+F169","v":53},{"$f":"G168+G169","v":75},"s/d","s/d","s/d"]
["Doctor en Ciencias Veterinarias",536,149,387,124,52,72,"s/d","s/d","s/d"]
["Doctor en Medicina y Tecnología Veterinaria",0,0,0,4,1,3,"s/d","s/d","s/d"]
["Paysandú"]
["Doctor en Ciencias Veterinarias ",{"$f":"SUM(C171:D171)","v":0},0,0,{"$f":"SUM(F171:G171)","v":12},10,2,"s/d","s/d","s/d"]
["Salto"]
["Doctor en Ciencias Veterinarias ",114,40,74,17,15,2,"s/d","s/d","s/d"]
[]
["FACULTAD DE INFORMACIÓN Y COMUNICACIÓN (F.I.C.) ",{"$f":"SUM(C175:D175)","v":1134},{"$f":"C176+C181","v":419},{"$f":"D176+D181","v":715},{"$f":"SUM(F175:G175)","v":132},{"$f":"F176+F181","v":43},{"$f":"G176+G181","v":89},"s/d","s/d","s/d"]
["Montevideo",1064,{"$f":"SUM(C177:C180)","v":408},{"$f":"SUM(D177:D180)","v":656},131,{"$f":"SUM(F177:F180)","v":43},{"$f":"SUM(G177:G180)","v":88},"s/d","s/d","s/d"]
["Licenciado en Bibliotecología",79,18,61,17,4,13,"s/d","s/d","s/d"]
["Licenciado en Archivología ",49,15,34,12,6,6,"s/d","s/d","s/d"]
["Licenciado en Ciencias de la Comunicación",936,375,561,83,32,51,"s/d","s/d","s/d"]
["Licenciado en Comunicación",0,0,0,19,1,18,"s/d","s/d","s/d"]
["Paysandú",70,{"$f":"C182+C183","v":11},{"$f":"D182+D183","v":59},1,{"$f":"F182+F183","v":0},{"$f":"G182+G183","v":1},"s/d","s/d","s/d"]
["Licenciado en Bibliotecología ",22,2,20,1,0,1,"s/d","s/d","s/d"]
["Licenciado en Archivología ",48,9,39,0,0,0,"s/d","s/d","s/d"]
[]
["INSTITUTO ESCUELA NACIONAL DE BELLAS ARTES ",{"$f":"+C185+D185","v":604},{"$f":"C186+C196+C198+C200","v":184},{"$f":"D186+D196+D198+D200","v":420},{"$f":"+F185+G185","v":66},{"$f":"F186+F196+F198+F200","v":22},{"$f":"G186+G196+G198+G200","v":44},"s/d","s/d","s/d"]
["Montevideo",{"$f":"+C186+D186","v":495},{"$f":"SUM(C187:C194)","v":136},{"$f":"SUM(D187:D194)","v":359},{"$f":"+F186+G186","v":54},{"$f":"SUM(F187:F194)","v":19},{"$f":"SUM(G187:G194)","v":35},"s/d","s/d","s/d"]
["Licenciado en Artes - Ciclo Básico",466,124,342,0,0,0,"s/d","s/d","s/d"]
["Licenciado en Arte Digital y Electrónico",29,12,17,0,0,0,"s/d","s/d","s/d"]
["Creador Plástico",0,0,0,13,3,10,"s/d","s/d","s/d"]
["Licenciado en Artes - Artes Plásticas y Visuales ",0,0,0,26,9,17,"s/d","s/d","s/d"]
["Licenciado en Artes - Dibujo y Pintura ",0,0,0,1,1,0,"s/d","s/d","s/d"]
["Licenciado en Artes - Cerámica",0,0,0,2,0,2,"s/d","s/d","s/d"]
["Licenciado en Artes - Diseño Gráfico ",0,0,0,1,1,0,"s/d","s/d","s/d"]
["Licenciado en Artes - Fotografía ",0,0,0,11,5,6,"s/d","s/d","s/d"]
["Maldonado"]
["Licenciado en Lenguaje y Medios Audiovisuales ",58,32,26,0,0,0,"s/d","s/d","s/d"]
["Paysandú"]
["Técnico en Tecnologías de la Imagen Fotográfica",29,10,19,7,2,5,"s/d","s/d","s/d"]
["Rocha"]
["Técnico en Artes Plásticas y Visuales ",22,6,16,5,1,4,"s/d","s/d","s/d"]
[]
["FACULTAD DE ENFERMERÍA ",{"$f":"SUM(C202:D202)","v":941},{"$f":"C204+C206+C208+C210","v":206},{"$f":"D204+D206+D208+D210","v":735},{"$f":"SUM(F202:G202)","v":244},{"$f":"F204+F206+F208+F210","v":34},{"$f":"G204+G206+G208+G210","v":210},"s/d","s/d","s/d"]
["Montevideo"]
["Licenciado en Enfermería ",{"$f":"SUM(C204:D204)","v":689},160,529,199,29,170,"s/d","s/d","s/d"]
["Rivera"]
["Licenciado en Enfermería ",{"$f":"SUM(C206:D206)","v":2},0,2,{"$f":"SUM(F206:G206)","v":32},3,29,"s/d","s/d","s/d"]
["Rocha"]
["Licenciado en Enfermería ",141,21,120,{"$f":"SUM(F208:G208)","v":2},0,2,"s/d","s/d","s/d"]
["Salto"]
["Licenciado en Enfermería ",109,25,84,11,2,9,"s/d","s/d","s/d"]
[]
["ESCUELA DE NUTRICIÓN ",{"$f":"SUM(C212:D212)","v":741},{"$f":"+C214+C216","v":144},{"$f":"+D214+D216","v":597},{"$f":"+F212+G212","v":112},{"$f":"+F214+F216","v":17},{"$f":"+G214+G216","v":95},"s/d","s/d","s/d"]
["Montevideo"]
["Licenciado en Nutrición ",726,143,583,{"$f":"+F214+G214","v":104},17,87,"s/d","s/d","s/d"]
["Tacuarembó"]
["Técnico Operador de Alimentos ",{"$f":"SUM(C216:D216)","v":15},1,14,{"$f":"SUM(F216:G216)","v":8},0,8,"s/d","s/d","s/d"]
[]
[]
["ESCUELA UNIVERSITARIA DE MÚSICA",{"$f":"SUM(C219:D219)","v":52},{"$f":"C220+C223","v":35},{"$f":"D220+D223","v":17},{"$f":"SUM(F219:G219)","v":10},{"$f":"F220+F223","v":8},{"$f":"G220+G223","v":2},"s/d","s/d","s/d"]
["Montevideo",46,{"$f":"SUM(C221:C222)","v":31},{"$f":"SUM(D221:D222)","v":15},{"$f":"SUM(F220:G220)","v":6},{"$f":"SUM(F221:F222)","v":5},{"$f":"SUM(G221:G222)","v":1},"s/d","s/d","s/d"]
["Licenciado en Música",17,12,5,4,3,1,"s/d","s/d","s/d"]
["Licenciado en Interpretación Musical",29,19,10,2,2,0,"s/d","s/d","s/d"]
["Salto",6,{"$f":"SUM(C224:C226)","v":4},{"$f":"SUM(D224:D226)","v":2},4,{"$f":"SUM(F224:F226)","v":3},{"$f":"SUM(G224:G226)","v":1},"s/d","s/d","s/d"]
["Técnico en Interpretación",5,3,2,0,0,0,"s/d","s/d","s/d"]
["Técnico en Interpretación  opción Guitarra ",0,0,0,1,1,0,"s/d","s/d","s/d"]
["Técnico en Dirección de Coros ",1,1,0,3,2,1,"s/d","s/d","s/d"]
[]
["ESCUELA DE PARTERAS",{"$f":"SUM(C228:D228)","v":441},{"$f":"SUM(C230:C232)","v":40},{"$f":"SUM(D230:D232)","v":401},{"$f":"SUM(F228:G228)","v":49},{"$f":"SUM(F230:F232)","v":0},{"$f":"SUM(G230:G232)","v":49},"s/d","s/d","s/d"]
["Montevideo"]
["Obstetra - Partera",{"$f":"SUM(C230:D230)","v":369},40,329,{"$f":"SUM(F230:G230)","v":35},0,35,"s/d","s/d","s/d"]
["Paysandú"]
["Licenciado en Obstetricia (Paysandú - Entre Ríos)",{"$f":"SUM(C232:D232)","v":72},0,72,{"$f":"SUM(F232:G232)","v":14},0,14,"s/d","s/d","s/d"]
[]
["FACULTAD DE PSICOLOGÍA",{"$f":"SUM(C234:D234)","v":2205},{"$f":"C236+C238+C240","v":536},{"$f":"D236+D238+D240","v":1669},{"$f":"SUM(F234:G234)","v":570},{"$f":"F236+F238+F240","v":85},{"$f":"G236+G238+G240","v":485},"s/d","s/d","s/d"]
["Montevideo"]
["Licenciado en Psicología",{"$f":"SUM(C236:D236)","v":2108},515,1593,{"$f":"SUM(F236:G236)","v":507},78,429,"s/d","s/d","s/d"]
["Paysandú"]
["Licenciado en Psicología ",26,4,22,5,0,5,"s/d","s/d","s/d"]
["Salto"]
["Licenciado en Psicología",71,17,54,58,7,51,"s/d","s/d","s/d"]
[]
["ESCUELA UNIVERSITARIA DE TECNOLOGÍA MEDICA",{"$f":"SUM(C242:D242)","v":1090},{"$f":"C243+C262+C273","v":220},{"$f":"D243+D262+D273","v":870},{"$f":"SUM(F242:G242)","v":399},{"$f":"F243+F262+F273","v":70},{"$f":"G243+G262+G273","v":329},"s/d","s/d","s/d"]
["Montevideo",816,{"$f":"SUM(C244:C261)","v":154},{"$f":"SUM(D244:D261)","v":662},337,{"$f":"SUM(F244:F261)","v":61},{"$f":"SUM(G244:G261)","v":276},"s/d","s/d","s/d"]
["Licenciado en Fisioterapia",92,34,58,61,14,47,"s/d","s/d","s/d"]
["Licenciado en Fonoaudiología",40,4,36,15,1,14,"s/d","s/d","s/d"]
["Licenciado en Imagenología",91,30,61,52,25,27,"s/d","s/d","s/d"]
["Licenciado en Instrumentación Quirúrgica",48,4,44,20,5,15,"s/d","s/d","s/d"]
["Licenciado en Neumocardiología",42,5,37,14,0,14,"s/d","s/d","s/d"]
["Licenciado en Neurofisiología Clínica",32,8,24,7,2,5,"s/d","s/d","s/d"]
["Licenciado en Oftalmología ",40,6,34,8,3,5,"s/d","s/d","s/d"]
["Licenciado en Psicomotricidad",48,2,46,70,1,69,"s/d","s/d","s/d"]
["Licenciado en Registros Médicos",47,12,35,4,1,3,"s/d","s/d","s/d"]
["Licenciado en Terapia Ocupacional",20,2,18,6,0,6,"s/d","s/d","s/d"]
["Licenciado en Laboratorio Clínico",93,16,77,17,1,16,"s/d","s/d","s/d"]
["Tecnólogo en Salud Ocupacional",12,3,9,0]
["Técnico en Anatomía Patológica",34,6,28,7,0,7,"s/d","s/d","s/d"]
["Técnico en Hemoterapia",41,9,32,24,4,20,"s/d","s/d","s/d"]
["Técnico en Podología",38,1,37,11,1,10,"s/d","s/d","s/d"]
["Técnico en Radioisótopos",30,5,25,4,1,3,"s/d","s/d","s/d"]
["Tecnólogo en Cosmetología Médica",38,0,38,13,1,12,"s/d","s/d","s/d"]
["Tecnólogo en Radioterapia",30,7,23,4,1,3,"s/d","s/d","s/d"]
["Paysandú",249,{"$f":"SUM(C263:C271)","v":60},{"$f":"SUM(D263:D271)","v":189},62,{"$f":"SUM(F263:F271)","v":9},{"$f":"SUM(G263:G271)","v":53},"s/d","s/d","s/d"]
["Licenciado en Fisioterapia ",51,17,34,10,4,6,"s/d","s/d","s/d"]
["Licenciado en Imagenología ",44,12,32,18,1,17,"s/d","s/d","s/d"]
["Licenciado en Instrumentación Quirúrgica ",15,7,8,1,0,1,"s/d","s/d","s/d"]
["Licenciado en Psicomotricidad ",34,1,33,12,0,12,"s/d","s/d","s/d"]
["Licenciado en Laboratorio Clínico ",19,1,18,4,0,4,"s/d","s/d","s/d"]
["Tecnólogo en Salud Ocupacional ",31,12,19,3,1,2,"s/d","s/d","s/d"]
["Técnico en Anatomía Patológica ",10,3,7,1,0,1,"s/d","s/d","s/d"]
["Técnico en Hemoterapia ",25,5,20,5,2,3,"s/d","s/d","s/d"]
["Técnico en Podología  ",20,2,18,8,1,7,"s/d","s/d","s/d"]
["Rocha"]
["Técnico en Hemoterapia",25,6,19,0,0,0,"s/d","s/d","s/d"]
[]
["FACULTAD DE CIENCIAS",{"$f":"SUM(C275:D275)","v":609},{"$f":"C276+C286+C287+C291","v":295},{"$f":"D276+D286+D287+D291","v":314},{"$f":"SUM(F275:G275)","v":85},{"$f":"F276+F286+F287+F291","v":27},{"$f":"G276+G286+G287+G291","v":58},"s/d","s/d","s/d"]
["Montevideo",{"$f":"SUM(C276:D276)","v":508},{"$f":"SUM(C277:C284)","v":254},{"$f":"SUM(D277:D284)","v":254},78,{"$f":"SUM(F277:F284)","v":25},{"$f":"SUM(G277:G284)","v":53},"s/d","s/d","s/d"]
["Licenciado en Bioquímica",{"$f":"SUM(C277:D277)","v":62},21,41,25,7,18,"s/d","s/d","s/d"]
["Licenciado en Ciencias Biológicas",219,84,135,34,11,23,"s/d","s/d","s/d"]
["Licenciado en Astronomía",32,21,11,0,0,0,"s/d","s/d","s/d"]
["Licenciado en Ciencias Física ",0,0,0,4,1,3,"s/d","s/d","s/d"]
["Licenciado en Física ",65,46,19,0,0,0,"s/d","s/d","s/d"]
["Licenciado en Geografía",35,20,15,4,2,2,"s/d","s/d","s/d"]
["Licenciado en Geología ",19,9,10,5,1,4,"s/d","s/d","s/d"]
["Licenciado en Matemática",76,53,23,6,3,3,"s/d","s/d","s/d"]
["Maldonado"]
["Licenciado en Gestión Ambiental ",60,24,36,2,0,2,"s/d","s/d","s/d"]
["Rivera",26,{"$f":"C288+C289","v":10},{"$f":"D288+D289","v":16},5,{"$f":"F288+F289","v":2},{"$f":"G288+G289","v":3},"s/d","s/d","s/d"]
["Licenciado en Recursos Naturales ",26,10,16,2,2,0,"s/d","s/d","s/d"]
["Técnico en Gestión de Recursos Naturales ",0,0,0,3,0,3,"s/d","s/d","s/d"]
["Rocha"]
["Licenciado en Gestión Ambiental ",15,7,8,0,0,0,"s/d","s/d","s/d"]
[]
["FACULTAD DE CIENCIAS SOCIALES",{"$f":"SUM(C293:D293)","v":1307},{"$f":"C294+C300+C305","v":344},{"$f":"D294+D300+D305","v":963},{"$f":"SUM(F293:G293)","v":218},{"$f":"F294+F300+F305","v":52},{"$f":"G294+G300+G305","v":166},"s/d","s/d","s/d"]
["Montevideo",1187,{"$f":"SUM(C295:C299)","v":319},{"$f":"SUM(D295:D299)","v":868},188,{"$f":"SUM(F295:F299)","v":49},{"$f":"SUM(G295:G299)","v":139},"s/d","s/d","s/d"]
["Estudios Iniciales en CCSS",1187,319,868,0,0,0,"s/d","s/d","s/d"]
["Licenciado en Ciencia Política",0,0,0,42,18,24,"s/d","s/d","s/d"]
["Licenciado en Sociología",0,0,0,35,14,21,"s/d","s/d","s/d"]
["Licenciado en Trabajo Social",0,0,0,101,12,89,"s/d","s/d","s/d"]
["Licenciado en Desarrollo",0,0,0,10,5,5,"s/d","s/d","s/d"]
["Salto",98,{"$f":"SUM(C301:C303)","v":17},{"$f":"SUM(D301:D303)","v":81},29,{"$f":"SUM(F301:F303)","v":3},{"$f":"SUM(G301:G303)","v":26},"s/d","s/d","s/d"]
["Estudios Iniciales en CCSS ",98,17,81,0,0,0,"s/d","s/d","s/d"]
["Licenciado en Ciencias Sociales ",0,0,0,2,0,2,"s/d","s/d","s/d"]
["Licenciado en Trabajo Social ",0,0,0,27,3,24,"s/d","s/d","s/d"]
["Tacuarembó"]
["Tec. en Desarrollo Regional Sustentable ",22,8,14,1,0,1,"s/d","s/d","s/d"]
[]
["INSTITUTO SUPERIOR DE EDUCACIÓN FÍSICA",{"$f":"SUM(C307:D307)","v":1671},{"$f":"C308+C313+C318+C322","v":1135},{"$f":"D308+D313+D318+D322","v":536},{"$f":"SUM(F307:G307)","v":196},{"$f":"F308+F313+F318+F322","v":122},{"$f":"G308+G313+G318+G322","v":74},"s/d","s/d","s/d"]
["Montevideo",{"$f":"SUM(C308:D308)","v":899},{"$f":"C309+C310+C311+C312","v":645},{"$f":"D309+D310+D311+D312","v":254},{"$f":"SUM(F308:G308)","v":110},{"$f":"F309+F310+F311+F312","v":74},{"$f":"G309+G310+G311+G312","v":36},"s/d","s/d","s/d"]
["Licenciado en Educación Física",{"$f":"SUM(C309:D309)","v":799},560,239,96,60,36,"s/d","s/d","s/d"]
["Técnico Deportivo Superior ",100,85,15,0,0,0,"s/d","s/d","s/d"]
["Técnico Deportivo Sup. - Fútbol ",0,0,0,13,13,0,"s/d","s/d","s/d"]
["Técnico Deportivo Sup. - Básquetbol",0,0,0,1,1,0,"s/d","s/d","s/d"]
["Maldonado",363,{"$f":"SUM(C314:C317)","v":235},{"$f":"SUM(D314:D317)","v":128},48,{"$f":"SUM(F314:F317)","v":24},{"$f":"SUM(G314:G317)","v":24},"s/d","s/d","s/d"]
["Licenciado en Educación Física ",287,188,99,38,19,19,"s/d","s/d","s/d"]
["Técnico Deportivo Superior ",76,47,29,{"$f":"SUM(F315:G315)","v":0},0,0,"s/d","s/d","s/d"]
["Técnico Deportivo Sup. -  Atletismo ",0,0,0,{"$f":"SUM(F316:G316)","v":4},2,2,"s/d","s/d","s/d"]
["Técnico Deportivo Sup. - Actividades Acuáticas ",0,0,0,6,3,3,"s/d","s/d","s/d"]
["Paysandú",254,{"$f":"C319+C320+C321","v":173},{"$f":"D319+D320+D321","v":81},36,{"$f":"F319+F320+F321","v":22},{"$f":"G319+G320+G321","v":14},"s/d","s/d","s/d"]
["Licenciado en Educación Física",150,104,46,35,22,13,"s/d","s/d","s/d"]
["Técnico Deportivo Superior ",104,69,35,0,0,0,"s/d","s/d","s/d"]
["Técnico Deportivo Sup. - Voleibol ",0,0,0,1,0,1,"s/d","s/d","s/d"]
["Rivera",155,{"$f":"SUM(C323:C325)","v":82},{"$f":"SUM(D323:D325)","v":73},2,{"$f":"SUM(F323:F325)","v":2},{"$f":"SUM(G323:G325)","v":0},"s/d","s/d","s/d"]
["Técnico Deportivo Sup. - Basquetbol ",0,0,0,1,1,0,"s/d","s/d","s/d"]
["Técnico Deportivo Sup. - Actividades Acuáticas ",0,0,0,1,1,0,"s/d","s/d","s/d"]
["Licenciado en Educación Física (Plan 2014) (ANEP)",155,82,73,0,0,0,"s/d","s/d","s/d"]
[]
["Área Salud",{"$f":"SUM(C327:D327)","v":253},{"$f":"C329","v":63},{"$f":"D329","v":190},{"$f":"SUM(F327:G327)","v":0},{"$f":"F329","v":0},{"$f":"G329","v":0},"s/d","s/d","s/d"]
[]
["Ciclo Inicial Optativo - Área Salud (Paysandú)",{"$f":"SUM(C329:D329)","v":253},63,190,{"$f":"SUM(F329:G329)","v":0},0,0,"s/d","s/d","s/d"]
[]
["Área Ciencias y Tecnología",{"$f":"SUM(C331:D331)","v":123},{"$f":"SUM(C333:C336)","v":71},{"$f":"SUM(D333:D336)","v":52},{"$f":"SUM(F331:G331)","v":0},{"$f":"SUM(F333:F336)","v":0},{"$f":"SUM(G333:G336)","v":0},"s/d","s/d","s/d"]
[]
["Ciclo Inicial Optativo - Área Cs y Tec (Maldonado)",{"$f":"SUM(C333:D333)","v":25},16,9,{"$f":"SUM(F333:G333)","v":0},0,0,"s/d","s/d","s/d"]
["Ciclo Inicial Optativo - Área Cs y Tec (Rocha)",{"$f":"SUM(C334:D334)","v":7},4,3,{"$f":"SUM(F334:G334)","v":0},0,0,"s/d","s/d","s/d"]
["Ciclo Inicial Optativo - Área Cs y Tec (Salto)",{"$f":"SUM(C335:D335)","v":86},50,36,0,0,0,"s/d","s/d","s/d"]
["Ciclo Inicial Optativo - Área Cs y Tec (Treinta y Tres)",{"$f":"SUM(C336:D336)","v":5},1,4,0,0,0,"s/d","s/d","s/d"]
[]
["Área Social",{"$f":"SUM(C338:D338)","v":705},{"$f":"C340+C341+C347+C348+C353+C358+C360","v":235},{"$f":"D340+D341+D347+D348+D353+D358+D360","v":470},{"$f":"SUM(F338:G338)","v":0},{"$f":"F340+F341+F347+F348+F353+F358+F360","v":0},{"$f":"G340+G341+G347+G348+G353+G358+G360","v":0},"s/d","s/d","s/d"]
["Cerro Largo"]
["Ciclo Inicial Optativo - Área Social ",{"$f":"SUM(C340:D340)","v":50},25,25,0,0,0,"s/d","s/d","s/d"]
["Maldonado",{"$f":"SUM(C341:D341)","v":294},{"$f":"SUM(C342:C345)","v":104},{"$f":"SUM(D342:D345)","v":190},0,{"$f":"SUM(F342:F345)","v":0},{"$f":"SUM(G342:G345)","v":0},"s/d","s/d","s/d"]
["Ciclo Inicial Optativo - Área Social Tray. Ciencias Sociales ",{"$f":"SUM(C342:D342)","v":31},8,23,0,0,0,"s/d","s/d","s/d"]
["Ciclo Inicial Optativo - Área Social Tray. Psicología ",{"$f":"SUM(C343:D343)","v":56},14,42,0,0,0,"s/d","s/d","s/d"]
["Ciclo Inicial Optativo - Área Social Tray. TAC ",130,46,84,0,0,0,"s/d","s/d","s/d"]
["Ciclo Inicial Optativo - Área Social Tray. Turismo ",77,36,41,0,0,0,"s/d","s/d","s/d"]
["Rivera"]
["Ciclo Inicial Optativo - Área Social ",53,20,33,{"$f":"SUM(F347:G347)","v":0},{"$f":"SUM(F348:F351)","v":0},{"$f":"SUM(G348:G351)","v":0},"s/d","s/d","s/d"]
["Rocha",33,{"$f":"SUM(C349:C352)","v":7},{"$f":"SUM(D349:D352)","v":26},0,{"$f":"SUM(F349:F352)","v":0},{"$f":"SUM(G349:G352)","v":0},"s/d","s/d","s/d"]
["Ciclo Inicial Optativo - Área Social Tray. Ciencias Sociales",11,2,9,0,0,0,"s/d","s/d","s/d"]
["Ciclo Inicial Optativo - Área Social Tray. Psicología ",3,1,2,0,0,0,"s/d","s/d","s/d"]
["Ciclo Inicial Optativo - Área Social Tray. TAC ",18,4,14,0,0,0,"s/d","s/d","s/d"]
["Ciclo Inicial Optativo - Área Social Tray. Turismo ",1,0,1,0,0,0,"s/d","s/d","s/d"]
["Salto",244,{"$f":"C354+C355+C356","v":72},{"$f":"D354+D355+D356","v":172},0,{"$f":"F354+F355+F356","v":0},{"$f":"G354+G355+G356","v":0},"s/d","s/d","s/d"]
["Ciclo Inicial Optativo - Área Social Tray. Psicología",{"$f":"SUM(C354:D354)","v":195},48,147,{"$f":"SUM(F354:G354)","v":0},0,0,"s/d","s/d","s/d"]
["Ciclo Inicial Optativo - Área Social Tray. Ciencias de la Comunicación ",{"$f":"SUM(C355:D355)","v":5},1,4,0,0,0,"s/d","s/d","s/d"]
["Ciclo Inicial Optativo - Área Social Tray. Ciencias Económicas ",44,23,21,0,0,0,"s/d","s/d","s/d"]
["Tacuarembó"]
["Ciclo Inicial Optativo - Área Social ",17,2,15,{"$f":"SUM(F358:G358)","v":0},0,0,"s/d","s/d","s/d"]
["Treinta y Tres"]
["Ciclo Inicial Optativo - Área Social Tray. TAC ",14,5,9,0,0,0,"s/d","s/d","s/d"]
[]
["Fac. Ciencias y Fac. Ingeniería ",{"$f":"SUM(C362:D362)","v":65},{"$f":"C363+C364","v":28},{"$f":"D363+D364","v":37},{"$f":"SUM(F362:G362)","v":1},{"$f":"F363+F364","v":1},{"$f":"G363+G364","v":0},"s/d","s/d","s/d"]
["Licenciado en Ciencias de la Atmósfera ",{"$f":"SUM(C363:D363)","v":41},20,21,{"$f":"SUM(F363:G363)","v":0},0,0,"s/d","s/d","s/d"]
["Tecnólogo en Cartografía",{"$f":"SUM(C364:D364)","v":24},8,16,{"$f":"SUM(F364:G364)","v":1},1,0,"s/d","s/d","s/d"]
[]
["Fac. Ingeniería y Fac. Química",{"$f":"SUM(C366:D366)","v":211},{"$f":"SUM(C367:C370)","v":98},{"$f":"SUM(D367:D370)","v":113},{"$f":"SUM(F366:G366)","v":45},{"$f":"SUM(F367:F370)","v":24},{"$f":"SUM(G367:G370)","v":21},"s/d","s/d","s/d"]
["Montevideo"]
["Ingeniero Químico",{"$f":"SUM(C368:D368)","v":206},97,109,{"$f":"SUM(F368:G368)","v":45},24,21,"s/d","s/d","s/d"]
["Salto"]
["Ingeniero Químico ",{"$f":"SUM(C370:D370)","v":5},1,4,0,0,0,"s/d","s/d","s/d"]
[]
["Ciencias Económicas y Administración y Ciencias",{"$f":"SUM(C372:D372)","v":111},{"$f":"SUM(C373)","v":59},{"$f":"SUM(D373)","v":52},0,{"$f":"SUM(F373)","v":0},{"$f":"SUM(G373)","v":0},"s/d","s/d","s/d"]
["Licenciado en Estadística ",{"$f":"SUM(C373:D373)","v":111},59,52,0,0,0,"s/d","s/d","s/d"]
[]
["Fac. Ingeniería, Fac. Química, Fac. Agronomía y Fac. Veterinaria",{"$f":"SUM(C375:D375)","v":105},{"$f":"C377+C379","v":25},{"$f":"D377+D379","v":80},{"$f":"SUM(F375:G375)","v":19},{"$f":"F377+F379","v":1},{"$f":"G377+G379","v":18},"s/d","s/d","s/d"]
["Montevideo"]
["Ingeniero Alimentario",{"$f":"SUM(C377:D377)","v":102},25,77,{"$f":"SUM(F377:G377)","v":19},1,18,"s/d","s/d","s/d"]
["Salto"]
["Ingeniero Alimentario",3,0,3,{"$f":"SUM(F379:G379)","v":0},0,0,"s/d","s/d","s/d"]
[]
["Fac. Ciencias, Fac. Humanidades y Ciencias de la Educación, Fac. Medicina y Fac. Odontología",{"$f":"SUM(C381:D381)","v":66},{"$f":"SUM(C383:C391)","v":17},{"$f":"SUM(D383:D391)","v":49},{"$f":"SUM(F381:G381)","v":5},{"$f":"SUM(F383:F391)","v":1},{"$f":"SUM(G383:G391)","v":4},"s/d","s/d","s/d"]
["Montevideo"]
["Licenciado en Biología Humana",{"$f":"SUM(C383:D383)","v":40},12,28,{"$f":"SUM(F383:G383)","v":5},1,4,"s/d","s/d","s/d"]
["Paysandú"]
["Licenciado en Biología Humana ",{"$f":"SUM(C385:D385)","v":5},1,4,{"$f":"SUM(F385:G385)","v":0},0,0,"s/d","s/d","s/d"]
["Rivera"]
["Licenciado en Biología Humana ",{"$f":"SUM(C387:D387)","v":5},1,4,{"$f":"SUM(F387:G387)","v":0},0,0,"s/d","s/d","s/d"]
["Salto"]
["Licenciado en Biología Humana ",{"$f":"SUM(C389:D389)","v":8},1,7,{"$f":"SUM(F389:G389)","v":0},0,0,"s/d","s/d","s/d"]
["Tacuarembó"]
["Licenciado en Biología Humana ",{"$f":"SUM(C391:D391)","v":8},2,6,{"$f":"SUM(F391:G391)","v":0},0,0,"s/d","s/d","s/d"]
[]
[]
["Fac. Agronomía, Fac. Ingeniería, C.E.T.P. - U.T.U.",{"$f":"SUM(C394:D394)","v":18},{"$f":"SUM(C396)","v":10},{"$f":"SUM(D396)","v":8},{"$f":"SUM(F394:G394)","v":1},{"$f":"SUM(F396)","v":1},{"$f":"SUM(G396)","v":0},"s/d","s/d","s/d"]
["Rivera"]
["Tecnólogo en Madera ",{"$f":"SUM(C396:D396)","v":18},10,8,{"$f":"SUM(F396:G396)","v":1},1,0,"s/d","s/d","s/d"]
[]
["Fac. Agronomía, Fac. Arquitectura, Diseño y Urbanismo",{"$f":"SUM(C398:D398)","v":41},{"$f":"C400","v":16},{"$f":"D400","v":25},{"$f":"SUM(F398:G398)","v":5},{"$f":"SUM(F400)","v":0},{"$f":"SUM(G400)","v":5},"s/d","s/d","s/d"]
["Maldonado"]
["Licenciatura en Diseño de Paisaje ",{"$f":"SUM(C400:D400)","v":41},16,25,{"$f":"SUM(F400:G400)","v":5},0,5,"s/d","s/d","s/d"]
[]
["Fac. Agronomía, Fac. Ingeniería, Fac. Química, Fac. Veterinaria y C.E.T.P. - U.T.U.",{"$f":"SUM(C402:D402)","v":21},{"$f":"SUM(C404)","v":11},{"$f":"SUM(D404)","v":10},{"$f":"SUM(F402:G402)","v":7},{"$f":"SUM(F404)","v":3},{"$f":"SUM(G404)","v":4},"s/d","s/d","s/d"]
["Tacuarembó"]
["Tecnólogo Cárnico ",{"$f":"SUM(C404:D404)","v":21},11,10,{"$f":"SUM(F404:G404)","v":7},3,4,"s/d","s/d","s/d"]
[]
["I.E.N.B.A. y Fac. Arquitectura, Diseño y Urbanismo",{"$f":"SUM(C406:D406)","v":236},{"$f":"SUM(C407)","v":88},{"$f":"SUM(D407)","v":148},{"$f":"SUM(F406:G406)","v":4},{"$f":"SUM(F407)","v":1},{"$f":"SUM(G407)","v":3},"s/d","s/d","s/d"]
["Licenciado en Diseño de Comunicación Visual",{"$f":"SUM(C407:D407)","v":236},88,148,{"$f":"SUM(F407:G407)","v":4},1,3,"s/d","s/d","s/d"]
[]
["Fac. Ciencias y Fac. Medicina",{"$f":"SUM(C409:D409)","v":33},{"$f":"SUM(C410)","v":17},{"$f":"SUM(D410)","v":16},{"$f":"SUM(F409:G409)","v":0},{"$f":"SUM(F410)","v":0},{"$f":"SUM(G410)","v":0},"s/d","s/d","s/d"]
["Licenciado en Física Médica",{"$f":"SUM(C410:D410)","v":33},17,16,{"$f":"SUM(F410:G410)","v":0},0,0,"s/d","s/d","s/d"]
[]
["Agronomía, Ciencias e Ingeniería",{"$f":"SUM(C412:D412)","v":10},{"$f":"C414","v":9},{"$f":"D414","v":1},{"$f":"SUM(F412:G412)","v":1},{"$f":"F414","v":1},{"$f":"G414","v":0},"s/d","s/d","s/d"]
["Treinta y Tres"]
["Tecnólogo Minero ",{"$f":"SUM(C414:D414)","v":10},9,1,{"$f":"SUM(F414:G414)","v":1},1,0,"s/d","s/d","s/d"]
[]
["Agronomía, Ingeniería y Química",{"$f":"SUM(C416:D416)","v":38},{"$f":"C418","v":22},{"$f":"D418","v":16},{"$f":"SUM(F416:G416)","v":0},{"$f":"F418","v":0},{"$f":"G418","v":0},"s/d","s/d","s/d"]
["Tacuarembó"]
["Ingeniero Forestal ",{"$f":"SUM(C418:D418)","v":38},22,16,{"$f":"SUM(F418:G418)","v":0},0,0,"s/d","s/d","s/d"]
[]
[]
["Bedelías de los Servicios Universitarios y Sistema de Gestión de Bedelías-SeCIU, UdelaR."]
["Programa de Evaluación y Estadística, UTEC"]
["Notas: "]
["Según Res. N°15 del CDC de fecha 23/10/12, se entiende por  Generación de Ingreso a Carrera  a todos los estudiantes que ingresan por primera vez a una carrera terciaria y/o de grado, en un año dado. No se consideran los estudiantes que ingresan a la carrera a través de un CIO o de un ciclo básico común en años anteriores. No se incluyen los estudiantes provisorios por previas, ni los de intercambio. Se incluyen los estudiantes de cortesía diplomática."]
["(*) Los estudiantes presentan inscripción simultánea a las dos carreras (Dr. en Derecho - Escribano Público)."]
["(1) Carrera compartida con EMAD"]
["(2) Carrera en convenio con CETP-UTU"]
["(3) El dato de Egresos 2017 es PRELIMINAR"]
["(4) Para observar la matrícula de UdelaR por carrera y servicio según el último  dato disponible coorrespondiente al VII Censo de estudiantes de grado 2012 debe dirigirse al Anuario Estadistico de la Educación 2013. Disponible en: http://educacion.mec.gub.uy/innovaportal/v/11078/5/mecweb/publicaciones?3colid=927&breadid=927"]

{"sheet":"II-7.2.2  ","index":87,"n_rows":194,"n_cols":32,"rows_kept":194,"cut":false,"hidden":false,"merged":[[6,2,6,3],[6,5,6,6],[6,8,6,9],[0,1,1,2],[0,5,1,8],[4,0,4,9],[5,0,7,0],[5,1,7,1],[5,2,5,3],[5,4,7,4],[5,5,5,6],[5,7,7,7],[5,8,5,9]]}
["UNIVERSIDADES PRIVADAS: OFERTA DE GRADO","ESTUDIANTES"]
[]
["Cuadro Nº II-7.2.2"]
[]
["ESTUDIANTES INGRESADOS, MATRICULADOS Y EGRESADOS EN PROGRAMAS DE GRADO EN UNIVERSIDADES PRIVADAS POR SEXO SEGÚN UNIVERSIDAD Y CARRERA (Todo el país, 2017)"]
["UNIVERSIDAD / CARRERA","TOTAL","INGRESADOS",null,"TOTAL","MATRICULADOS",null,"TOTAL","EGRESADOS"]
[null,null,"SEXO",null,null,"SEXO",null,null,"SEXO"]
[null,null,"V","M",null,"V","M",null,"V","M"]
["TOTAL",{"$f":"SUM(C9:D9)","v":3282},{"$f":"C11+C92+C124+C154","v":1683},{"$f":"+D11+D92+D124+D154","v":1599},{"$f":"SUM(F9:G9)","v":20291},{"$f":"+F11+F92+F124+F154","v":10280},{"$f":"+G11+G92+G124+G154","v":10011},{"$f":"SUM(I9:J9)","v":2090},{"$f":"+I11+I92+I124+I154","v":934},{"$f":"+J11+J92+J124+J154","v":1156},null,null,null,null,null,null,null,null,null,null,null,null,null,null,null,null,null,{"$f":"+AE9+AF9","v":3},null,null,1,2]
[null,null,null,null,null,null,null,null,null,null,null,null,null,null,null,null,null,null,null,null,null,null,null,null,null,null,null,{"$f":"+AE10+AF10","v":24},null,null,10,14]
["UCUDAL",{"$f":"SUM(C11:D11)","v":1286},{"$f":"+C13+C27+C52+C66+C70+C82+C88","v":575},{"$f":"D13+D27+D52+D66+D70+D82+D88","v":711},{"$f":"SUM(F11:G11)","v":6891},{"$f":"+F13+F27+F52+F66+F70+F82+F88","v":2981},{"$f":"+G13+G27+G52+G66+G70+G82+G88","v":3910},{"$f":"SUM(I11:J11)","v":794},{"$f":"+I13+I27+I52+I66+I70+I82+I88","v":295},{"$f":"+J13+J27+J52+J66+J70+J82+J88","v":499}]
[]
["FACULTAD DE CIENCIAS HUMANAS",{"$f":"SUM(C13:D13)","v":196},{"$f":"SUM(C14:C25)","v":70},{"$f":"SUM(D14:D25)","v":126},{"$f":"SUM(F13:G13)","v":971},{"$f":"SUM(F14:F25)","v":319},{"$f":"SUM(G14:G25)","v":652},{"$f":"SUM(I13:J13)","v":121},{"$f":"SUM(I14:I25)","v":35},{"$f":"SUM(J14:J25)","v":86}]
["Licenciatura En Artes Visuales",{"$f":"SUM(C14:D14)","v":16},5,11,48,16,32,0,0,0]
["Licenciatura En Ciencia Política",6,4,2,15,9,6,2,1,1]
["Licenciatura En Comunicación",103,38,65,572,209,363,85,25,60]
["Licenciatura En Educación Inicial",30,2,28,149,4,145,9,0,9]
["Licenciatura En Recreación Educativa",19,9,10,62,36,26,4,3,1]
["Licenciatura En Sociología",8,7,1,29,14,15,9,4,5]
["Licenciatura En Trabajo Social",7,1,6,27,4,23,4,0,4]
["Tecnicatura En Recreación",7,4,3,20,12,8,0,0,0]
["Licenciatura En Ciencias Sociales",0,0,0,15,3,12,3,2,1]
["Licenciatura En Educación - Opción Tiempo Libre Y Recreación",0,0,0,31,11,20,5,0,5]
["Técnico En Educación Para El Tiempo Libre Y La Recreacion",0,0,0,2,0,2,0,0,0]
["Tecnicatura En Educación Social",0,0,0,1,1,0,0,0,0]
[]
["FACULTAD DE CIENCIAS EMPRESARIALES",{"$f":"SUM(C27:D27)","v":451},{"$f":"+C28+C37+C45","v":275},{"$f":"+D28+D37+D45","v":176},{"$f":"SUM(F27:G27)","v":2631},{"$f":"+F28+F37+F45","v":1418},{"$f":"+G28+G37+G45","v":1213},{"$f":"SUM(I27:J27)","v":304},{"$f":"+I28+I37+I45","v":147},{"$f":"+J28+J37+J45","v":157}]
["Montevideo",{"$f":"SUM(C28:D28)","v":343},{"$f":"SUM(C29:C36)","v":214},{"$f":"SUM(D29:D36)","v":129},{"$f":"SUM(F28:G28)","v":1967},{"$f":"SUM(F29:F36)","v":1086},{"$f":"SUM(G29:G36)","v":881},{"$f":"SUM(I28:J28)","v":232},{"$f":"SUM(I29:I36)","v":114},{"$f":"SUM(J29:J36)","v":118}]
["Contador Público",{"$f":"SUM(C29:D29)","v":102},59,43,750,374,376,100,46,54]
["Licenciatura En Dirección De Empresas",86,63,23,406,272,134,39,22,17]
["Licenciatura En Dirección De Empresas Turísticas",22,11,11,111,50,61,21,5,16]
["Licenciatura En Economía",23,18,5,137,90,47,15,11,4]
["Licenciatura En Gestión Humana Y Relaciones Laborales",20,5,15,70,18,52,5,0,5]
["Licenciatura En Gestión Logística",25,13,12,51,29,22,0,0,0]
["Licenciatura En Negocios Internacionales E Integración",65,45,20,399,241,158,49,30,19]
["Licenciatura En Recursos Humanos Y Relaciones Laborales",0,0,0,43,12,31,3,0,3]
["Maldonado",{"$f":"SUM(C37:D37)","v":43},{"$f":"SUM(C38:C44)","v":27},{"$f":"SUM(D38:D44)","v":16},{"$f":"SUM(F37:G37)","v":215},{"$f":"SUM(F38:F44)","v":115},{"$f":"SUM(G38:G44)","v":100},{"$f":"SUM(I37:J37)","v":11},{"$f":"SUM(I38:I44)","v":5},{"$f":"SUM(J38:J44)","v":6}]
["Contador Público",15,9,6,117,54,63,7,2,5]
["Licenciatura En Dirección De Empresas",13,8,5,79,48,31,4,3,1]
["Licenciatura En Dirección De Empresas Turísticas",1,0,1,2,1,1,0,0,0]
["Licenciatura En Economía",3,3,0,3,3,0,0,0,0]
["Licenciatura En Gestión Humana Y Relaciones Laborales",1,1,0,1,1,0,0,0,0]
["Licenciatura En Gestión Logística",1,0,1,1,0,1,0,0,0]
["Licenciatura En Negocios Internacionales E Integración",9,6,3,12,8,4,0,0,0]
["Salto",{"$f":"SUM(B46:B50)","v":65},34,31,449,217,232,61,28,33]
["Contador Público",50,22,28,368,175,193,48,21,27]
["Licenciatura En Dirección De Empresas",7,6,1,58,28,30,10,4,6]
["Licenciatura En Gestión Agrícola Ganadera",4,3,1,17,10,7,3,3,0]
["Licenciatura En Gestión Logística",1,1,0,1,1,0,0,0,0]
["Licenciatura En Negocios Internacionales E Integración",3,2,1,5,3,2,0,0,0]
[]
["FACULTAD DE INGENIERÍA Y TECNOLOGÍAS",{"$f":"B53+B62","v":171},{"$f":"C53+C62","v":125},{"$f":"D53+D62","v":46},1001,747,254,82,59,23]
["Montevideo",{"$f":"SUM(B54:B61)","v":161},{"$f":"SUM(C54:C61)","v":116},{"$f":"SUM(D54:D61)","v":45},974,724,250,82,59,23]
["Ingeniería De Alimentos",{"$f":"SUM(C54:D54)","v":18},6,12,{"$f":"SUM(F54:G54)","v":102},25,77,{"$f":"SUM(I54:J54)","v":2},0,2]
["Ingeniería En Electrónica",12,11,1,64,55,9,11,8,3]
["Ingeniería En Informática",37,28,9,307,262,45,21,16,5]
["Ingeniería En Sistemas Eléctricos De Potencia",15,12,3,40,30,10,2,0,2]
["Ingeniería En Telecomunicación",8,6,2,46,32,14,5,4,1]
["Ingeniería Industrial",40,25,15,223,173,50,8,8,0]
["Licenciatura En Informática",21,18,3,99,83,16,26,20,6]
["Licenciatura En Ingeniería Audiovisual",10,10,0,93,64,29,7,3,4]
["Salto",{"$f":"SUM(B63:B64)","v":10},{"$f":"SUM(C63:C64)","v":9},1,27,23,4,0,0,0]
["Ingeniería En Informática",2,2,0,5,5,0,0,0,0]
["Licenciatura En Informática",8,7,1,22,18,4,0,0,0]
[]
["FACULTAD DE DERECHO",{"$f":"SUM(C66:D66)","v":54},{"$f":"C67+C68","v":24},{"$f":"D67+D68","v":30},{"$f":"SUM(F66:G66)","v":306},{"$f":"F67+F68","v":133},{"$f":"G67+G68","v":173},{"$f":"SUM(I66:J66)","v":40},{"$f":"I67+I68","v":19},{"$f":"J67+J68","v":21}]
["Dr. en Derecho",{"$f":"SUM(C67:D67)","v":35},18,17,{"$f":"SUM(F67:G67)","v":239},114,125,{"$f":"SUM(I67:J67)","v":30},16,14]
["Notariado",{"$f":"SUM(C68:D68)","v":19},6,13,{"$f":"SUM(F68:G68)","v":67},19,48,{"$f":"SUM(I68:J68)","v":10},3,7]
[]
["FACULTAD DE PSICOLOGÍA",{"$f":"SUM(C70:D70)","v":256},{"$f":"C71+C78","v":36},{"$f":"D71+D78","v":220},{"$f":"SUM(F70:G70)","v":1309},{"$f":"F71+F78","v":211},{"$f":"G71+G78","v":1098},{"$f":"SUM(I70:J70)","v":173},{"$f":"I71+I78","v":24},{"$f":"J71+J78","v":149}]
["Montevideo",231,{"$f":"SUM(C72:C77)","v":35},{"$f":"SUM(D72:D77)","v":196},1284,{"$f":"SUM(F72:F77)","v":210},{"$f":"SUM(G72:G77)","v":1074},173,{"$f":"SUM(I72:I77)","v":24},{"$f":"SUM(J72:J77)","v":149}]
["Licenciatura En Fonoaudiología",17,3,14,55,6,49,4,0,4]
["Licenciatura En Psicología",121,26,95,710,152,558,114,24,90]
["Licenciatura En Psicomotricidad",36,2,34,192,6,186,31,0,31]
["Licenciatura En Psicopedagogía",38,0,38,233,9,224,24,0,24]
["Licenciatura En Seguridad Y Salud Ocupacional",8,2,6,56,29,27,0,0,0]
["Tecnicatura En Acompañamiento Terapéutico",11,2,9,38,8,30,0,0,0]
["Salto",25,{"$f":"C79+C80","v":1},{"$f":"D79+D80","v":24},25,{"$f":"F79+F80","v":1},{"$f":"G79+G80","v":24},0,{"$f":"I79+I80","v":0},{"$f":"J79+J80","v":0}]
["Licenciatura En Psicología",1,0,1,1,0,1,0,0,0]
["Licenciatura En Psicopedagogía",24,1,23,24,1,23,0,0,0]
[]
["FACULTAD DE ENFERMERÍA Y TECNOLOGÍAS DE LA SALUD",{"$f":"SUM(C82:D82)","v":125},{"$f":"SUM(C83:C86)","v":39},{"$f":"SUM(D83:D86)","v":86},{"$f":"SUM(F82:G82)","v":550},{"$f":"SUM(F83:F86)","v":133},{"$f":"SUM(G83:G86)","v":417},{"$f":"SUM(I82:J82)","v":64},{"$f":"SUM(I83:I86)","v":10},{"$f":"SUM(J83:J86)","v":54}]
["Licenciatura En Enfermería",14,1,13,59,5,54,11,0,11]
["Licenciatura En Enfermería - Profesionalización De Auxiliares",16,6,10,68,9,59,15,1,14]
["Licenciatura En Fisioterapia",55,25,30,210,86,124,16,5,11]
["Licenciatura En Nutrición",40,7,33,213,33,180,22,4,18]
[]
["FACULTAD DE ODONTOLOGÍA ",{"$f":"SUM(C88:D88)","v":33},{"$f":"C89+C90","v":6},{"$f":"D89+D90","v":27},{"$f":"SUM(F88:G88)","v":123},{"$f":"F89+F90","v":20},{"$f":"G89+G90","v":103},{"$f":"SUM(I88:J88)","v":10},{"$f":"I89+I90","v":1},{"$f":"J89+J90","v":9}]
["Asistente Dental",{"$f":"SUM(C89:D89)","v":7},2,5,{"$f":"SUM(F89:G89)","v":12},2,10,{"$f":"SUM(I89:J89)","v":0},0,0]
["Odontología",{"$f":"SUM(C90:D90)","v":26},4,22,{"$f":"SUM(F90:G90)","v":111},18,93,{"$f":"SUM(I90:J90)","v":10},1,9]
[]
["UNIVERSIDAD ORT URUGUAY",{"$f":"SUM(C92:D92)","v":1057},{"$f":"+C94+C100+C104+C112","v":579},{"$f":"+D94+D100+D104+D112","v":478},{"$f":"SUM(F92:G92)","v":7121},{"$f":"+F94+F100+F104+F112","v":4097},{"$f":"+G94+G100+G104+G112","v":3024},{"$f":"SUM(I92:J92)","v":607},{"$f":"+I94+I100+I104+I112","v":328},{"$f":"+J94+J100+J104+J112","v":279}]
[null,null,null,null,null,null,null,null,null,null,null,null,null,null,null,null,null,null,null,null,null,null,null,null,null,null,null,null,null,null,17,15]
["FACULTAD DE ADMINISTRACIÓN Y CIENCIAS SOCIALES",{"$f":"SUM(C94:D94)","v":379},{"$f":"SUM(C95:C98)","v":191},{"$f":"SUM(D95:D98)","v":188},{"$f":"SUM(F94:G94)","v":2333},{"$f":"SUM(F95:F98)","v":1305},{"$f":"SUM(G95:G98)","v":1028},{"$f":"SUM(I94:J94)","v":225},{"$f":"SUM(I95:I98)","v":130},{"$f":"SUM(J95:J98)","v":95},null,null,null,null,null,null,null,null,null,null,null,null,null,null,null,null,null,null,null,null,22,33]
["Licenciatura en Gerencia y Administración",{"$f":"SUM(C95:D95)","v":192},108,84,{"$f":"SUM(F95:G95)","v":1113},669,444,{"$f":"SUM(I95:J95)","v":108},68,40]
["Licenciatura en Estudios Internacionales",{"$f":"SUM(C96:D96)","v":60},17,43,{"$f":"SUM(F96:G96)","v":340},147,193,{"$f":"SUM(I96:J96)","v":36},18,18]
["Licenciatura en Economía",{"$f":"SUM(C97:D97)","v":31},16,15,{"$f":"SUM(F97:G97)","v":173},114,59,{"$f":"SUM(I97:J97)","v":11},7,4]
["Contador Público",{"$f":"SUM(C98:D98)","v":96},50,46,{"$f":"SUM(F98:G98)","v":707},375,332,{"$f":"SUM(I98:J98)","v":70},37,33]
[]
["FACULTAD DE ARQUITECTURA",{"$f":"SUM(C100:D100)","v":84},{"$f":"SUM(C101:C102)","v":25},{"$f":"SUM(D101:D102)","v":59},{"$f":"SUM(F100:G100)","v":698},{"$f":"SUM(F101:F102)","v":227},{"$f":"SUM(G101:G102)","v":471},{"$f":"SUM(I100:J100)","v":91},{"$f":"SUM(I101:I102)","v":23},{"$f":"SUM(J101:J102)","v":68}]
["Arquitectura",{"$f":"SUM(C101:D101)","v":62},23,39,{"$f":"SUM(F101:G101)","v":493},203,290,{"$f":"SUM(I101:J101)","v":65},23,42]
["Licenciatura en Diseño de Interiores",{"$f":"SUM(C102:D102)","v":22},2,20,{"$f":"SUM(F102:G102)","v":205},24,181,{"$f":"SUM(I102:J102)","v":26},0,26]
[]
["FACULTAD DE COMUNICACIÓN Y DISEÑO",{"$f":"SUM(C104:D104)","v":278},{"$f":"SUM(C105:C110)","v":110},{"$f":"SUM(D105:D110)","v":168},{"$f":"SUM(F104:G104)","v":1701},{"$f":"SUM(F105:F110)","v":688},{"$f":"SUM(G105:G110)","v":1013},{"$f":"SUM(I104:J104)","v":112},{"$f":"SUM(I105:I110)","v":34},{"$f":"SUM(J105:J110)","v":78}]
["Licenciatura en Comunicación",71,27,44,548,226,322,44,15,29]
["Licenciatura en Diseño Gráfico",71,21,50,418,142,276,28,8,20]
["Licenciatura en Diseño de Modas",28,0,28,202,4,198,13,0,13]
["Licenciatura en Diseño Industrial",32,10,22,154,66,88,12,0,12]
["Licenciatura en Diseño Multimedia",28,17,11,152,87,65,10,8,2]
["Licenciatura en Animación y Videojuegos",48,35,13,227,163,64,5,3,2]
[]
["FACULTAD DE INGENIERÍA",{"$f":"SUM(C112:D112)","v":316},{"$f":"SUM(C113:C122)","v":253},{"$f":"SUM(D113:D122)","v":63},{"$f":"SUM(F112:G112)","v":2389},{"$f":"SUM(F113:F122)","v":1877},{"$f":"SUM(G113:G122)","v":512},{"$f":"SUM(I112:J112)","v":179},{"$f":"SUM(I113:I122)","v":141},{"$f":"SUM(J113:J122)","v":38}]
["Licenciatura en Sistemas",101,85,16,789,663,126,61,51,10]
["Ingeniería en Telecomunicaciones",6,5,1,116,101,15,9,9,0]
["Ingeniería en Sistemas",147,130,17,1075,910,165,65,53,12]
["Ingeniería en Electrónica",9,7,2,101,86,15,13,11,2]
["Licenciatura  en Electrónica",0,0,0,2,2,0,0,0,0]
["Licenciatura en  Telecomunicaciones",0,0,0,3,3,0,1,1,0]
["Licenciatura en Biotecnología",6,4,2,115,38,77,3,2,1]
["Ingeniería en Biotecnología",39,16,23,170,59,111,20,8,12]
["Licenciatura en Ingeniería de Software",0,0,0,9,8,1,7,6,1]
["Ingeniería Eléctrica",8,6,2,9,7,2,0,0,0]
[]
["UNIVERSIDAD DE MONTEVIDEO",{"$f":"SUM(C124:D124)","v":369},{"$f":"+C126+C132+C138+C147+C151","v":177},{"$f":"+D126+D132+D138+D147+D151","v":192},{"$f":"SUM(F124:G124)","v":2800},{"$f":"+F126+F132+F138+F147+F151","v":1313},{"$f":"+G126+G132+G138+G147+G151","v":1487},{"$f":"SUM(I124:J124)","v":290},{"$f":"+I126+I132+I138+I147+I151","v":121},{"$f":"+J126+J132+J138+J147+J151","v":169}]
[]
["FACULTAD DE CIENCIAS EMPRESARIALES Y ECONOMÍA",{"$f":"SUM(C126:D126)","v":168},{"$f":"SUM(C127:C130)","v":92},{"$f":"SUM(D127:D130)","v":76},{"$f":"SUM(F126:G126)","v":1249},{"$f":"SUM(F127:F130)","v":642},{"$f":"SUM(G127:G130)","v":607},{"$f":"SUM(I126:J126)","v":139},{"$f":"SUM(I127:I130)","v":62},{"$f":"SUM(J127:J130)","v":77}]
["Lic. en Administración de Empresas",{"$f":"SUM(C127:D127)","v":44},25,19,{"$f":"SUM(F127:G127)","v":309},181,128,{"$f":"SUM(I127:J127)","v":40},22,18]
["Lic. en Economía",{"$f":"SUM(C128:D128)","v":30},17,13,{"$f":"SUM(F128:G128)","v":213},114,99,{"$f":"SUM(I128:J128)","v":18},12,6]
["Contador Público",56,30,26,{"$f":"SUM(F129:G129)","v":523},260,263,63,23,40]
["Lic. en Negocios Internacionales",38,20,18,{"$f":"SUM(F130:G130)","v":204},87,117,18,5,13]
[]
["FACULTAD DE INGENIERÍA",{"$f":"SUM(C132:D132)","v":67},{"$f":"SUM(C133:C136)","v":52},{"$f":"SUM(D133:D136)","v":15},{"$f":"SUM(F132:G132)","v":505},{"$f":"SUM(F133:F136)","v":375},{"$f":"SUM(G133:G136)","v":130},{"$f":"SUM(I132:J132)","v":56},{"$f":"SUM(I133:I136)","v":40},{"$f":"SUM(J133:J136)","v":16}]
["Ingeniería Civil",{"$f":"SUM(C133:D133)","v":16},11,5,{"$f":"SUM(F133:G133)","v":190},124,66,{"$f":"SUM(I133:J133)","v":28},20,8]
["Ingeniería Industrial",{"$f":"SUM(C134:D134)","v":20},14,6,{"$f":"SUM(F134:G134)","v":200},159,41,{"$f":"SUM(I134:J134)","v":20},15,5]
["Ingeniería Telemática",8,5,3,58,44,14,7,5,2]
["Ingeniería en Informática",23,22,1,57,48,9,1,0,1]
[]
["FACULTAD DE HUMANIDADES Y EDUCACIÓN",{"$f":"SUM(C138:D138)","v":65},{"$f":"SUM(C139:C145)","v":15},{"$f":"SUM(D139:D145)","v":50},{"$f":"SUM(F138:G138)","v":435},{"$f":"SUM(F139:F145)","v":94},{"$f":"SUM(G139:G145)","v":341},{"$f":"SUM(I138:J138)","v":43},{"$f":"SUM(I139:I145)","v":4},{"$f":"SUM(J139:J145)","v":39}]
["Lic. en Humanidades",{"$f":"SUM(C139:D139)","v":11},4,7,{"$f":"SUM(F139:G139)","v":79},30,49,{"$f":"SUM(I139:J139)","v":2},1,1]
["Lic. en Traducción Inglés<> Español",{"$f":"SUM(C140:D140)","v":17},6,11,{"$f":"SUM(F140:G140)","v":133},25,108,{"$f":"SUM(I140:J140)","v":17},1,16]
["Magisterio",16,0,16,92,3,89,15,1,14]
["Profesorado de Matemática",18,4,14,80,20,60,8,1,7]
["Profesorado de Historia",1,0,1,17,10,7,0,0,0]
["Profesorado de Filosofía",0,0,0,11,4,7,0,0,0]
["Profesorado de Inglés",2,1,1,23,2,21,1,0,1]
[]
["FACULTAD DE DERECHO",{"$f":"SUM(C147:D147)","v":43},{"$f":"SUM(C148:C149)","v":13},{"$f":"SUM(D148:D149)","v":30},{"$f":"SUM(F147:G147)","v":343},{"$f":"SUM(F148:F149)","v":121},{"$f":"SUM(G148:G149)","v":222},{"$f":"SUM(I147:J147)","v":36},{"$f":"SUM(I148:I149)","v":14},{"$f":"SUM(J148:J149)","v":22}]
["Abogacía",{"$f":"SUM(C148:D148)","v":39},13,26,{"$f":"SUM(F148:G148)","v":254},94,160,{"$f":"SUM(I148:J148)","v":22},6,16]
["Notariado",{"$f":"SUM(C149:D149)","v":4},0,4,{"$f":"SUM(F149:G149)","v":89},27,62,{"$f":"SUM(I149:J149)","v":14},8,6]
[]
["FACULTAD DE COMUNICACIÓN",{"$f":"SUM(C151:D151)","v":26},{"$f":"SUM(C152:C152)","v":5},{"$f":"SUM(D152:D152)","v":21},{"$f":"SUM(F151:G151)","v":268},{"$f":"SUM(F152:F152)","v":81},{"$f":"SUM(G152:G152)","v":187},{"$f":"SUM(I151:J151)","v":16},{"$f":"SUM(I152:I152)","v":1},{"$f":"SUM(J152:J152)","v":15}]
["Licenciatura en Comunicación",{"$f":"SUM(C152:D152)","v":26},5,21,{"$f":"SUM(F152:G152)","v":268},81,187,{"$f":"SUM(I152:J152)","v":16},1,15]
[]
["UNIVERSIDAD DE LA EMPRESA",{"$f":"SUM(C154:D154)","v":570},{"$f":"C156+C163+C169+C181+C185+C188+C191","v":352},{"$f":"D156+D163+D169+D181+D185+D188+D191","v":218},{"$f":"SUM(F154:G154)","v":3479},{"$f":"F156+F163+F169+F181+F185+F188+F191","v":1889},{"$f":"G156+G163+G169+G181+G185+G188+G191","v":1590},{"$f":"SUM(I154:J154)","v":399},{"$f":"I156+I163+I169+I181+I185+I188+I191","v":190},{"$f":"J156+J163+J169+J181+J185+J188+J191","v":209}]
[]
["FACULTAD DE CIENCIAS JURÍDICAS",{"$f":"SUM(C156:D156)","v":34},{"$f":"C157+C161","v":16},{"$f":"D157+D161","v":18},{"$f":"SUM(F156:G156)","v":249},{"$f":"F157+F161","v":99},{"$f":"G157+G161","v":150},{"$f":"SUM(I156:J156)","v":13},{"$f":"I157+I161","v":6},{"$f":"J157+J161","v":7}]
["Montevideo",{"$f":"SUM(C157:D157)","v":20},{"$f":"C158+C159","v":10},{"$f":"D158+D159","v":10},{"$f":"SUM(F157:G157)","v":205},{"$f":"F158+F159","v":86},{"$f":"G158+G159","v":119},{"$f":"SUM(I157:J157)","v":13},{"$f":"I158+I159","v":6},{"$f":"J158+J159","v":7}]
["Doctor en Derecho",8,4,4,103,57,46,7,5,2]
["Escribano Público",12,6,6,102,29,73,6,1,5]
["Colonia"]
["Doctor en Derecho",14,6,8,44,13,31,0,0,0]
[]
["FACULTAD DE DISEÑO Y COMUNICACIÓN",{"$f":"SUM(C163:D163)","v":27},{"$f":"SUM(C164:C167)","v":2},{"$f":"SUM(D164:D167)","v":25},{"$f":"SUM(F163:G163)","v":170},{"$f":"SUM(F164:F167)","v":37},{"$f":"SUM(G164:G167)","v":133},{"$f":"SUM(I163:J163)","v":9},{"$f":"SUM(I164:I167)","v":2},{"$f":"SUM(J164:J167)","v":7}]
["Licenciatura en Diseño Aplicado",{"$f":"SUM(C164:D164)","v":0},0,0,{"$f":"SUM(F164:G164)","v":17},6,11,{"$f":"SUM(I164:J164)","v":1},1,0]
["Licenciatura en Diseño de Indumentaria",{"$f":"SUM(C165:D165)","v":11},1,10,{"$f":"SUM(F165:G165)","v":21},2,19,{"$f":"SUM(I165:J165)","v":3},0,3]
["Licenciatura en Diseño Gráfico",{"$f":"SUM(C166:D166)","v":16},1,15,{"$f":"SUM(F166:G166)","v":68},23,45,{"$f":"SUM(I166:J166)","v":5},1,4]
["Licenciatura en Diseño Industrial",{"$f":"SUM(C167:D167)","v":0},0,0,{"$f":"SUM(F167:G167)","v":64},6,58,{"$f":"SUM(I167:J167)","v":0},0,0]
[]
["FACULTAD DE CIENCIAS EMPRESARIALES",{"$f":"SUM(C169:D169)","v":222},{"$f":"C170+C176","v":126},{"$f":"D170+D176","v":96},{"$f":"SUM(F169:G169)","v":1966},{"$f":"F170+F176","v":994},{"$f":"G170+G176","v":972},{"$f":"SUM(I169:J169)","v":118},{"$f":"I170+I176","v":48},{"$f":"J170+J176","v":70}]
["Montevideo",174,{"$f":"SUM(C171:C175)","v":106},{"$f":"SUM(D171:D175)","v":68},1756,{"$f":"SUM(F171:F175)","v":919},{"$f":"SUM(G171:G175)","v":837},103,{"$f":"SUM(I171:I175)","v":44},{"$f":"SUM(J171:J175)","v":59}]
["Contador Público",52,22,30,594,261,333,24,8,16]
["Licenciatura en Administración de Empresas",43,32,11,466,262,204,31,14,17]
["Licenciatura en Comercio Exterior",19,15,4,133,84,49,6,4,2]
["Licenciatura en Marketing",50,34,16,448,278,170,27,13,14]
["Licenciatura en Recursos Humanos",10,3,7,115,34,81,15,5,10]
["Colonia",48,{"$f":"SUM(C177:C179)","v":20},{"$f":"SUM(D177:D179)","v":28},210,{"$f":"SUM(F177:F179)","v":75},{"$f":"SUM(G177:G179)","v":135},15,{"$f":"SUM(I177:I179)","v":4},{"$f":"SUM(J177:J179)","v":11}]
["Contador Público",34,17,17,139,51,88,5,0,5]
["Licenciatura en Administración de Empresas",7,1,6,54,18,36,10,4,6]
["Licenciatura en Recursos Humanos",7,2,5,17,6,11,0,0,0]
[]
["FACULTAD DE CIENCIAS DE LA SALUD",{"$f":"SUM(C181:D181)","v":70},{"$f":"SUM(C182:C183)","v":30},{"$f":"SUM(D182:D183)","v":40},{"$f":"SUM(F181:G181)","v":223},{"$f":"SUM(F182:F183)","v":107},{"$f":"SUM(G182:G183)","v":116},{"$f":"SUM(I181:J181)","v":169},{"$f":"SUM(I182:I183)","v":67},{"$f":"SUM(J182:J183)","v":102}]
["Licenciatura en Fisioterapia",{"$f":"SUM(C182:D182)","v":42},18,24,{"$f":"SUM(F182:G182)","v":124},65,59,{"$f":"SUM(I182:J182)","v":11},4,7]
["Licenciatura en Imagenología",{"$f":"SUM(C183:D183)","v":28},12,16,{"$f":"SUM(F183:G183)","v":99},42,57,{"$f":"SUM(I183:J183)","v":158},63,95]
[]
["FACULTAD DE INGENIERÍA",{"$f":"SUM(C185:D185)","v":61},{"$f":"SUM(C186:C187)","v":56},{"$f":"SUM(D186:D187)","v":5},{"$f":"SUM(F185:G185)","v":404},{"$f":"SUM(F186:F187)","v":306},{"$f":"SUM(G186:G187)","v":98},{"$f":"SUM(I185:J185)","v":20},{"$f":"SUM(I186:I187)","v":17},{"$f":"SUM(J186:J187)","v":3}]
["Ingeniería en Informática",8,7,1,88,71,17,0,0,0]
["Licenciatura en Informática",53,49,4,316,235,81,20,17,3]
["FACULTAD DE EDUCACIÓN",65,{"$f":"C189","v":58},{"$f":"D189","v":7},77,{"$f":"F189","v":68},{"$f":"G189","v":9},0,{"$f":"I189","v":0},{"$f":"J189","v":0}]
["Licenciatura en Educación Física, Deportes y Recreación",65,58,7,77,68,9,0,0,0]
[]
["FACULTAD DE CIENCIAS AGRARIAS",{"$f":"SUM(C191:D191)","v":91},{"$f":"SUM(C192:C193)","v":64},{"$f":"SUM(D192:D193)","v":27},{"$f":"SUM(F191:G191)","v":390},{"$f":"SUM(F192:F193)","v":278},{"$f":"SUM(G192:G193)","v":112},{"$f":"SUM(I191:J191)","v":70},{"$f":"SUM(I192:I193)","v":50},{"$f":"SUM(J192:J193)","v":20}]
["Ingeniero Agrónomo",{"$f":"SUM(C192:D192)","v":49},34,15,{"$f":"SUM(F192:G192)","v":242},173,69,{"$f":"SUM(I192:J192)","v":28},23,5]
["Licenciado en Gestión Agropecuaria",{"$f":"SUM(C193:D193)","v":42},30,12,{"$f":"SUM(F193:G193)","v":148},105,43,{"$f":"SUM(I193:J193)","v":42},27,15]
["Fuente: Oficinas Productoras de cada una de las Instituciones. "]

{"sheet":"II-7.2.3 ","index":88,"n_rows":57,"n_cols":10,"rows_kept":57,"cut":false,"hidden":false,"merged":[[6,5,6,6],[6,8,6,9],[59,0,59,3],[0,5,1,8],[4,0,4,9],[5,0,7,0],[5,1,7,1],[5,2,5,3],[5,4,7,4],[5,5,5,6],[5,7,7,7],[5,8,5,9],[6,2,6,3]]}
["INSTITUTOS UNIVERSITARIOS: OFERTA DE GRADO",null,null,null,null,"ESTUDIANTES"]
[]
["Cuadro Nº II-7.2.3"]
[]
["ESTUDIANTES INGRESADOS, MATRICULADOS Y EGRESADOS EN PROGRAMAS DE GRADO DE INSTITUTOS UNIVERSITARIOS Y OFERTAS UNIVERSITARIAS DEL ÁREA SEGURIDAD Y DEFENSA POR SEXO SEGÚN INSTITUCIÓN Y CARRERA (Todo el país, 2017)"]
["INSTITUTO UNIVERSITARIO / CARRERA","TOTAL","INGRESADOS",null,"TOTAL","MATRICULADOS",null,"TOTAL","EGRESADOS"]
[null,null,"SEXO",null,null,"SEXO",null,null,"SEXO"]
[null,null,"V","M",null,"V","M",null,"V","M"]
["TOTAL",{"$f":"SUM(C9:D9)","v":457},{"$f":"C11+C18+C26+C29+C32+C39+C44+C49+C54","v":198},{"$f":"D11+D18+D26+D29+D32+D39+D44+D49+D54","v":259},{"$f":"SUM(F9:G9)","v":1900},{"$f":"F11+F18+F26+F29+F32+F39+F44+F49+F54","v":890},{"$f":"G11+G18+G26+G29+G32+G39+G44+G49+G54","v":1010},{"$f":"SUM(I9:J9)","v":343},{"$f":"I11+I18+I26+I29+I32+I39+I44+I49+I54","v":154},{"$f":"J11+J18+J26+J29+J32+J39+J44+J49+J54","v":189}]
[]
["INST UNIV ASOCIACIÓN CRISTIANA DE JÓVENES",{"$f":"SUM(C11:D11)","v":167},{"$f":"C12+C15","v":106},{"$f":"D12+D15","v":61},{"$f":"SUM(F11:G11)","v":550},{"$f":"F12+F15","v":390},{"$f":"G12+G15","v":160},{"$f":"SUM(I11:J11)","v":185},{"$f":"I12+I15","v":124},{"$f":"J12+J15","v":61}]
["Montevideo",{"$f":"SUM(C12:D12)","v":157},{"$f":"C13+C14","v":96},{"$f":"D13+D14","v":61},{"$f":"SUM(F12:G12)","v":511},{"$f":"F13+F14","v":359},{"$f":"G13+G14","v":152},{"$f":"SUM(I12:J12)","v":185},{"$f":"I13+I14","v":124},{"$f":"J13+J14","v":61}]
["Licenciatura en Educación Física, Recreación y Deporte",86,58,28,393,295,98,141,104,37]
["Tecnicatura en Fitness con orientación en Modalidades de Gimnasia y/o Entrenamiento Personalizado",71,38,33,118,64,54,44,20,24]
["Maldonado",10,{"$f":"C16+C17","v":10},{"$f":"D16+D17","v":0},39,{"$f":"F16+F17","v":31},{"$f":"G16+G17","v":8},0,{"$f":"I16+I17","v":0},{"$f":"J16+J17","v":0}]
["Licenciatura en Educación Física, Recreación y Deporte",0,0,0,16,15,1,0,0,0]
["Tecnicatura en Fitness con orientación en Modalidades de Gimnasia y/o Entrenamiento Personalizado",10,10,0,23,16,7,0,0,0]
["INST UNIV CLAEH",{"$f":"B20+B21","v":93},{"$f":"C20+C21","v":32},61,447,157,290,79,23,56]
["Montevideo"]
["Licenciatura en Gestión Cultural",{"$f":"SUM(C20:D20)","v":11},2,9,{"$f":"SUM(F20:G20)","v":58},17,41,{"$f":"SUM(I20:J20)","v":6},1,5]
["Maldonado",{"$f":"SUM(B22:B24)","v":82},{"$f":"SUM(C22:C24)","v":30},52,389,140,249,{"$f":"SUM(H22:H24)","v":73},22,51]
["Medicina",{"$f":"SUM(C22:D22)","v":41},15,26,{"$f":"SUM(F22:G22)","v":244},93,151,{"$f":"SUM(I22:J22)","v":38},15,23]
["Abogacia",{"$f":"SUM(C23:D23)","v":40},15,25,{"$f":"SUM(F23:G23)","v":115},37,78,{"$f":"SUM(I23:J23)","v":18},4,14]
["Notariado",{"$f":"SUM(C24:D24)","v":1},0,1,{"$f":"SUM(F24:G24)","v":30},10,20,{"$f":"SUM(I24:J24)","v":17},3,14]
[]
["INST METODISTA UNIV CRANDON ",{"$f":"SUM(C26:D26)","v":1},{"$f":"SUM(C27:C27)","v":1},{"$f":"SUM(D27:D27)","v":0},{"$f":"SUM(F26:G26)","v":36},{"$f":"SUM(F27:F27)","v":4},{"$f":"SUM(G27:G27)","v":32},{"$f":"SUM(I26:J26)","v":0},{"$f":"SUM(I27:I27)","v":0},{"$f":"SUM(J27:J27)","v":0}]
["Licenciatura en Gestión de Empresas",{"$f":"SUM(C27:D27)","v":1},1,0,{"$f":"SUM(F27:G27)","v":36},4,32,{"$f":"SUM(I27:J27)","v":0},0,0]
[]
["INST UNIV MONSEÑOR MARIANO SOLER - ",{"$f":"SUM(C29:D29)","v":13},{"$f":"SUM(C30:C30)","v":6},{"$f":"SUM(D30:D30)","v":7},{"$f":"SUM(F29:G29)","v":59},{"$f":"SUM(F30:F30)","v":50},{"$f":"SUM(G30:G30)","v":9},{"$f":"SUM(I29:J29)","v":4},{"$f":"SUM(I30:I30)","v":4},{"$f":"SUM(J30:J30)","v":0}]
["Licenciatura en Ciencias Teológicas",{"$f":"SUM(C30:D30)","v":13},6,7,{"$f":"SUM(F30:G30)","v":59},50,9,{"$f":"SUM(I30:J30)","v":4},4,0]
[]
["INST UNIV FRANCISCO DE ASÍS ",{"$f":"+C32+D32","v":37},{"$f":"SUM(C34:C37)","v":10},{"$f":"SUM(D34:D37)","v":27},{"$f":"+F32+G32","v":434},{"$f":"SUM(F34:F37)","v":150},{"$f":"SUM(G34:G37)","v":284},{"$f":"+I32+J32","v":11},{"$f":"SUM(I34:I37)","v":1},{"$f":"SUM(J34:J37)","v":10}]
["Maldonado"]
["Contador Público",{"$f":"+C34+D34","v":11},5,6,{"$f":"+F34+G34","v":171},54,117,{"$f":"+I34+J34","v":4},1,3]
["Licenciatura en Administración y Dirección de Empresas",{"$f":"+C35+D35","v":6},1,5,{"$f":"+F35+G35","v":102},40,62,{"$f":"+I35+J35","v":5},0,5]
["Licenciatura en Turismo",{"$f":"+C36+D36","v":6},1,5,{"$f":"+F36+G36","v":98},37,61,{"$f":"+I36+J36","v":2},0,2]
["Licenciatura en Psicología",{"$f":"+C37+D37","v":14},3,11,{"$f":"+F37+G37","v":63},19,44,{"$f":"+I37+J37","v":0},0,0]
[]
["INST UNIV CEDIIAP",{"$f":"+C39+D39","v":43},{"$f":"SUM(C40:C42)","v":3},{"$f":"SUM(D40:D42)","v":40},{"$f":"+F39+G39","v":100},{"$f":"SUM(F40:F42)","v":8},{"$f":"SUM(G40:G42)","v":92},{"$f":"+I39+J39","v":32},{"$f":"SUM(I40:I42)","v":0},{"$f":"SUM(J40:J42)","v":32}]
["Licenciatura en Psicomotricidad",{"$f":"+C40+D40","v":12},0,12,{"$f":"+F40+G40","v":36},1,35,{"$f":"+I40+J40","v":11},0,11]
["Licenciatura en Psicopedagogía",{"$f":"+C41+D41","v":24},2,22,{"$f":"+F41+G41","v":56},2,54,{"$f":"+I41+J41","v":20},0,20]
["Licenciatura en Musicoterapia",{"$f":"+C42+D42","v":7},1,6,{"$f":"+F42+G42","v":8},5,3,{"$f":"+I42+J42","v":1},0,1]
[]
["FUNDACIÓN POLITÉCNICO DE PUNTA DEL ESTE",{"$f":"+C44+D44","v":0},{"$f":"C45+C46","v":0},{"$f":"D45+D46","v":0},{"$f":"+F44+G44","v":35},{"$f":"F45+F46","v":12},{"$f":"G45+G46","v":23},{"$f":"+I44+J44","v":9},{"$f":"I45+I46","v":0},{"$f":"J45+J46","v":9}]
["Contador Público",{"$f":"+C45+D45","v":0},0,0,{"$f":"+F45+G45","v":28},10,18,{"$f":"+I45+J45","v":6},0,6]
["Licenciado en Economía y Finanzas Aplicadas",{"$f":"+C46+D46","v":0},0,0,{"$f":"+F46+G46","v":7},2,5,{"$f":"+I46+J46","v":3},0,3]
[]
[]
["INSTITUTO  UNIVERSITARIO ELBIO FERNÁNDEZ ",{"$f":"+C49+D49","v":37},{"$f":"C50+C51+C52","v":0},{"$f":"D50+D51+D52","v":37},{"$f":"+F49+G49","v":64},{"$f":"F50+F51+F52","v":0},{"$f":"G50+G51+G52","v":64},{"$f":"+I49+J49","v":21},{"$f":"I50+I51+I52","v":0},{"$f":"J50+J51+J52","v":21}]
["Lic.  en Educacion Escolar",{"$f":"C50+D50","v":6},0,6,{"$f":"F50+G50","v":6},0,6,{"$f":"I50+J50","v":0},0,0]
["Maestro Educación Primaria",6,0,6,12,0,12,3,0,3]
["Tecnicatura en 1ª Infancia",25,0,25,46,0,46,18,0,18]
[]
["ESCUELA DE FORMACION PROFESIONAL EN COMERCIO EXTERIOR Y ADUANA",66,{"$f":"C55","v":40},{"$f":"D55","v":26},{"$f":"F54+G54","v":175},{"$f":"F55","v":119},{"$f":"G55","v":56},{"$f":"I54+J54","v":2},{"$f":"I55","v":2},{"$f":"J55","v":0}]
["Perito en Comercio Exterior y Aduana",66,40,26,175,119,56,2,2,0]
[]
["Fuente: Oficinas Productoras de cada una de las Instituciones. "]

{"sheet":"II-7.2.4  ","index":89,"n_rows":80,"n_cols":7,"rows_kept":80,"cut":false,"hidden":false,"merged":[[78,0,78,6],[79,0,79,7],[0,2,1,4],[4,0,4,6],[5,0,6,0],[5,1,6,1],[5,2,5,5],[77,0,77,6]]}
["UNIVERSIDADES  E INSTITUTOS UNIVERSITARIOS",null,"ESTUDIANTES"]
[]
["Cuadro Nº II-7.2.4"]
[]
["ESTUDIANTES INGRESADOS Y MATRICULADOS DE GRADO EN UNIVERSIDADES E INSTITUTOS UNIVERSITARIOS, SEGÚN INSTITUCIÓN Y LUGAR DE ORIGEN (Todo el país, 2017)"]
["INSTITUCIÓN / FORMACIÓN","TOTAL","ORIGEN DE LOS ESTUDIANTES"]
[null,null,"Total Uruguay","Montevideo","Interior","Extranjero","Sin dato"]
[]
["UDELAR (*)"]
["Ingresados",{"$f":"SUM(D10:G10)","v":0},{"$f":"SUM(D10:E10)","v":0},"s/d","s/d","s/d","s/d"]
["Ingresados Posgrado",{"$f":"SUM(D11:G11)","v":0},{"$f":"SUM(D11:E11)","v":0},"s/d","s/d","s/d","s/d"]
[]
["UNIVERSIDAD TECNOLÓGICA (UTEC)"]
["Ingresados",{"$f":"SUM(D14:G14)","v":492},{"$f":"SUM(D14:E14)","v":491},38,453,1,0]
["Ingresados Posgrado","na.","na.","na.","na.","na.","na."]
[]
["UCUDAL"]
["Ingresados",{"$f":"SUM(D18:G18)","v":1286},{"$f":"SUM(D18:E18)","v":1271},811,460,0,15]
["Ingresados Posgrado",{"$f":"SUM(D19:G19)","v":639},{"$f":"SUM(D19:E19)","v":144},95,49,21,474]
[]
["UNIVERSIDAD ORT URUGUAY"]
["Ingresados",{"$f":"SUM(D22:G22)","v":1057},{"$f":"SUM(D22:E22)","v":1039},781,258,18,0]
["Ingresados Posgrado",{"$f":"SUM(D23:G23)","v":213},"s/d","s/d","s/d","s/d",213]
[]
["UNIVERSIDAD DE MONTEVIDEO"]
["Ingresados",{"$f":"SUM(D26:G26)","v":738},{"$f":"SUM(D26:E26)","v":366},264,102,3,369]
["Ingresados Posgrado",{"$f":"SUM(D27:G27)","v":245},"s/d","s/d","s/d","s/d",245]
[]
["UNIVERSIDAD DE LA EMPRESA"]
["Ingresados",{"$f":"SUM(D30:G30)","v":578},{"$f":"SUM(D30:E30)","v":578},386,192,0,0]
["Ingresados Posgrado",{"$f":"SUM(D31:G31)","v":720},{"$f":"SUM(D31:E31)","v":74},44,30,646,0]
[]
["INST UNIV ASOCIACIÓN CRISTIANA DE JÓVENES"]
["Ingresados",{"$f":"SUM(D34:G34)","v":167},{"$f":"SUM(D34:E34)","v":0},"s/d","s/d","s/d",167]
["Ingresados Posgrado",{"$f":"SUM(D35:G35)","v":18},{"$f":"SUM(D35:E35)","v":0},"s/d","s/d","s/d",18]
[]
["INST UNIV CLAEH "]
["Ingresados",{"$f":"SUM(D38:G38)","v":93},{"$f":"SUM(D38:E38)","v":81},8,73,12,0]
["Ingresados Posgrado",{"$f":"SUM(D39:G39)","v":102},{"$f":"SUM(D39:E39)","v":102},49,53,0,0]
[]
["INST METODISTA UNIV CRANDON "]
["Ingresados",{"$f":"SUM(D42:G42)","v":1},{"$f":"SUM(D42:E42)","v":1},1,0,0,0]
["Ingresados Posgrado","na.","na.","na.","na.","na.","na."]
[]
["INST UNIV MONSEÑOR MARIANO SOLER"]
["Ingresados",{"$f":"SUM(D46:G46)","v":13},{"$f":"SUM(D46:E46,G46)","v":10},10,0,3,0]
["Ingresados Posgrado","na.","na.","na.","na.","na.","na."]
[]
["INST UNIV FRANCISCO DE ASÍS"]
["Ingresados",{"$f":"SUM(D50:G50)","v":37},{"$f":"SUM(D50:E50)","v":34},4,30,3,0]
["Ingresados Posgrado","na.","na.","na.","na.","na.","na."]
[]
["INST UNIV CEDIIAP"]
["Ingresados",{"$f":"SUM(D54:G54)","v":43},{"$f":"SUM(D54:E54)","v":43},28,15,0,0]
["Ingresados Posgrado","na.","na.","na.","na.","na.","na."]
[]
["FUNDACIÓN POLITÉCNICO DE PUNTA DEL ESTE"]
["Ingresados","s/d","s/d","s/d","s/d","s/d","s/d"]
["Ingresados Posgrado","na.","na.","na.","na.","na.","na."]
[]
["ESCUELA MILITAR"]
["Ingresados",{"$f":"SUM(D62:G62)","v":99},{"$f":"D62+E62","v":99},35,64,0,0]
["Ingresados Posgrado","na.","na.","na.","na.","na.","na."]
["Centro de Altos Estudios Nacionales"]
["Ingresados","na.","na.","na.","na.","na.","na."]
["Ingresados Posgrado",{"$f":"SUM(D66:G66)","v":40},{"$f":"D66+E66","v":24},24,0,3,13]
["IPES"]
["Ingresados","na.","na.","na.","na.","na.","na."]
["Ingresados Posgrado","s/d","s/d","s/d","s/d","s/d","s/d"]
["Instituto Universitario Elbio Fernández"]
["Ingresados",{"$f":"SUM(D71:G71)","v":64},{"$f":"D71+E71","v":63},55,8,1,0]
["Ingresados Posgrado","na.","na.","na.","na.","na.","na."]
["IUCEDDU"]
["Ingresados","na.","na.","na.","na.","na.","na."]
["Ingresados Posgrado",{"$f":"SUM(D75:G75)","v":8},{"$f":"D75+E75","v":8},7,1,0,0]
[]
["Fuente: Oficinas Productoras de cada una de las Instituciones. "]
["Nota:  La categoría \"Sin dato\" refiere a los  alumnos de los cuales no se cuenta con información de origen. "]
[]
["\"na.\", No aplica se refiere, en este caso, a instituciones que no imparten cursos de grado o posgrado."]

{"sheet":"II-7.2.5","index":90,"n_rows":367,"n_cols":7,"rows_kept":367,"cut":false,"hidden":false,"merged":[[0,3,1,6],[4,0,4,3],[5,0,7,0],[5,1,7,1],[5,2,5,3],[5,4,7,4],[5,5,5,6],[6,2,6,3],[6,5,6,6],[375,0,375,6],[376,0,376,6],[377,0,377,6],[369,0,369,6],[370,0,370,6],[371,0,371,6],[372,0,372,6],[373,0,373,6],[374,0,374,6]]}
["UNIVERSIDAD DE LA REPÚBLICA: OFERTA DE POSTGRADO",null,null,"ESTUDIANTES"]
[]
["Cuadro Nº II-7.2.5"]
[]
["ESTUDIANTES INGRESADOS 2017 Y EGRESADOS PRELIMINARES 2017 EN PROGRAMAS DE POSTGRADO DE LA UNIVERSIDAD DE LA REPÚBLICA POR SEXO SEGÚN SERVICIO UNIVERSITARIO Y ACREDITACIÓN  (Todo el país, 2017)"]
["SERVICIO UNIVERSITARIO / ACREDITACIÓN","TOTAL","INGRESADOS",null,"TOTAL","EGRESADOS (datos preliminares)"]
[null,null,"SEXO",null,null,"SEXO"]
[null,null,"V","M",null,"V","M"]
["TOTAL",{"$f":"SUM(C9:D9)","v":3179},{"$f":"C11+C29+C38+C74+C101+C196+C206+C222+C229+C237+C244+C253+C267+C288+C298+C301+C304+C308+C311+C314+C317+C321+C334+C338+C341+C344+C347+C350+C353+C356+C359","v":1044},{"$f":"D11+D29+D38+D74+D101+D196+D206+D222+D229+D237+D244+D253+D267+D288+D298+D301+D304+D308+D311+D314+D317+D321+D334+D338+D341+D344+D347+D350+D353+D356+D359","v":2135},{"$f":"SUM(F9:G9)","v":1573},{"$f":"F11+F29+F38+F74+F101+F196+F206+F222+F229+F237+F244+F253+F267+F288+F298+F301+F304+F308+F311+F314+F317+F321+F334+F338+F341+F344+F347+F350+F353+F356+F359","v":512},{"$f":"G11+G29+G38+G74+G101+G196+G206+G222+G229+G237+G244+G253+G267+G288+G298+G301+G304+G308+G311+G314+G317+G321+G334+G338+G341+G344+G347+G350+G353+G356+G359","v":1061}]
[]
["FACULTAD DE CIENCIAS ECONÓMICAS Y ADMINISTRACIÓN",{"$f":"+C11+D11","v":301},{"$f":"SUM(C12:C27)","v":118},{"$f":"SUM(D12:D27)","v":183},{"$f":"+F11+G11","v":195},{"$f":"SUM(F12:F27)","v":76},{"$f":"SUM(G12:G27)","v":119}]
["Diploma de Especialización en Costos y Gestión Empresarial",15,8,7,20,7,13]
["Posgrado de Especialización  en Administración",26,10,16,18,6,12]
["Posgrado de Especialización en Finanzas",29,15,14,7,4,3]
["Posgrado de Especialización en Marketing",26,9,17,12,7,5]
["Diploma de Posgrado en Sistemas de Información de las Organizaciones y Gestión de Empresas de TI",21,10,11,26,12,14]
["Maestría en Economía",19,9,10,3,1,2]
["Maestría en Finanzas",15,12,3,11,6,5]
["Maestría en Gerencia y Administración (MBA) ",52,20,32,17,11,6]
["Maestría en Tributación",26,5,21,18,3,15]
["Posgrado de Especialización en Tributación",11,4,7,30,11,19]
["Diploma en Economía",0,0,0,2,1,1]
["Posgrado de Especialización en Contabilidad",11,4,7,15,5,10]
["Posgrado de Especialización en Auditoria",3,0,3,0,0,0]
["Diploma de Posgrado en Gestión Financiera en Instituciones Públicas",27,5,22,11,1,10]
["Especialización en Economía y Gestión para la Inclusión",13,5,8,5,1,4]
["Maestría en Contabilidad y Auditoría",7,2,5,0,0,0]
[]
["FACULTAD DE DERECHO",{"$f":"+C29+D29","v":60},{"$f":"SUM(C30:C36)","v":18},{"$f":"SUM(D30:D36)","v":42},{"$f":"+F29+G29","v":7},{"$f":"SUM(F30:F36)","v":0},{"$f":"SUM(G30:G36)","v":7}]
["Especialización en Derecho Comercial",{"$f":"+C30+D30","v":0},0,0,1,0,1]
["Especialización en Derecho del Trabajo y de la Seguridad Social",0,0,0,1,0,1]
["Especialización en Derecho Procesal",37,12,25,0,0,0]
["Especialización en Derecho Internacional Público",6,1,5,1,0,1]
["Maestría en Derecho con Orientación en Derecho Internacional Público",17,5,12,0,0,0]
["Maestría en Relaciones  Internacionales",0,0,0,3,0,3]
["Maestría en Derecho orientación Derecho Comercial",0,0,0,1,0,1]
[]
["FACULTAD DE INGENIERÍA",{"$f":"+C38+D38","v":140},{"$f":"SUM(C39:C72)","v":93},{"$f":"SUM(D39:D72)","v":47},{"$f":"+F38+G38","v":84},{"$f":"SUM(F39:F72)","v":54},{"$f":"SUM(G39:G72)","v":30}]
["Diploma en Especialización en Gestión de Tecnologías",7,4,3,17,7,10]
["Diploma en Especialización en Ingeniería de Software",4,2,2,5,5,0]
["Diploma en Especialización en Seguridad Informática",2,1,1,8,6,2]
["Diploma en Especialización en Sist. de Información y Tecnologías de Gestión de Datos",2,2,0,5,4,1]
["Diploma en Sistemas Eléctricos de Potencia",2,1,1,1,1,0]
["Diploma de Especialización en Telecomunicaciones",1,1,0,1,1,0]
["Diploma en Ingeniería de la Energía",5,1,4,10,5,5]
["Diploma de Especialización en Hidrología Subterránea",11,8,3,0,0,0]
["Doctorado en Informática (PEDECIBA) ",0,0,0,1,0,1]
["Doctorado en Ingeniería Eléctrica",4,4,0,3,3,0]
["Doctorado en Ingeniería Física",1,1,0,0,0,0]
["Doctorado en Ingeniería Química",4,0,4,2,1,1]
["Doctorado Ingeniería Estructural",5,5,0,1,1,0]
["Maestría en Gestión de la Innovación",2,0,2,1,1,0]
["Maestría en Informática (PEDECIBA) ",0,0,0,3,2,1]
["Maestría en Ingeniería Ambiental",5,1,4,3,1,2]
["Maestría en Ingeniería de la Celulosa y Papel",0,0,0,1,1,0]
["Maestría en Ingeniería de la Energía",28,22,6,2,1,1]
["Maestría en Ingeniería de Software",1,1,0,1,1,0]
["Maestría en Ingeniería Eléctrica",14,11,3,6,6,0]
["Maestría en Ingeniería en Computación",1,1,0,0,0,0]
["Maestría en Ingeniería en Mecánica de los Fluidos Aplicada",7,4,3,3,1,2]
["Maestría en Ingeniería Estructural",10,6,4,1,1,0]
["Maestría en Ingeniería Física",0,0,0,0,0,0]
["Maestría en Ingeniería Matemática",8,5,3,4,2,2]
["Maestría en Ingeniería Química",4,3,1,2,0,2]
["Maestría en Ingeniería de Minas",1,0,1,0,0,0]
["Maestría en Seguridad Informática",1,1,0,0,0,0]
["Maestría en Sistemas de Información y Gestión de Datos",2,2,0,1,1,0]
["Maestría en Investigación de Operaciones",1,1,0,0,0,0]
["Doctorado en Ingeniería de la Energía ",3,3,0,0,0,0]
["Diploma de Especialización en Ingeniería de Minas",1,0,1,0,0,0]
["Doctorado en Ingeniería Ambiental",1,1,0,1,1,0]
["Doctorado en Ingeniería en Mecánica de los Fluidos Aplicada",2,1,1,1,1,0]
[]
["FACULTAD DE CIENCIAS SOCIALES",{"$f":"+C74+D74","v":274},{"$f":"SUM(C75:C99)","v":81},{"$f":"SUM(D75:D99)","v":193},{"$f":"+F74+G74","v":111},{"$f":"SUM(F75:F99)","v":44},{"$f":"SUM(G75:G99)","v":67}]
["Diploma de Análisis Sociodemográfico aplicado a la Gestión",0,0,0,3,1,2]
["Diploma de Intervención Familiar",0,0,0,5,1,4]
["Diploma de Políticas de Drogas, Regulación y Control",33,11,22,6,1,5]
["Diploma en Afrodescendencia y Políticas Públicas",0,0,0,10,1,9]
["Diploma en Carnaval y Patrimonio",0,0,0,1,0,1]
["Diploma en Ciencia Política",0,0,0,7,4,3]
["Diploma en Economía para No Economistas",17,9,8,7,3,4]
["Diploma en Economía y Gestión Bancaria",43,17,26,25,8,17]
["Diploma en Estudios Internacionales, Sistema Internacional e Integración",0,0,0,1,0,1]
["Diploma en Género y Políticas Públicas",24,1,23,6,0,6]
["Diploma en Historia Económica",0,0,0,5,4,1]
["Diploma en Políticas Sociales",35,9,26,5,0,5]
["Diploma Jóvenes, Juventud y Políticas Públicas",15,3,12,2,1,1]
["Diploma en Penalidad Juvenil",40,5,35,0,0,0]
["Doctorado en Ciencia Política",4,2,2,2,2,0]
["Doctorado en Ciencias Sociales",6,2,4,0,0,0]
["Maestría Bimodal en Estudios Contemp. de América Latina",3,2,1,3,3,0]
["Maestría en Ciencia Política",1,0,1,3,2,1]
["Maestría en Demografía y Estudios de Población",0,0,0,1,0,1]
["Maestría en Economía Internacional",18,11,7,6,3,3]
["Maestría en Historia Económica",0,0,0,2,1,1]
["Maestría en Sociología",1,0,1,5,3,2]
["Maestría en Trabajo Social",0,0,0,2,2,0]
["Maestría en Políticas Públicas",34,9,25,0,0,0]
["Maestría en Historia Política",0,0,0,4,4,0]
[]
["FACULTAD DE MEDICINA ",{"$f":"+C101+D101","v":1051},{"$f":"SUM(C102:C194)","v":306},{"$f":"SUM(D102:D194)","v":745},{"$f":"+F101+G101","v":720},{"$f":"SUM(F102:F194)","v":219},{"$f":"SUM(G102:G194)","v":501}]
["Diploma en Coordinación de Trasplantes",5,0,5,0,0,0]
["Diploma en Cuidados Paliativos del Adulto",29,3,26,4,1,3]
["Diploma en Emergentología ",6,0,6,0,0,0]
["Diploma en Emergentología (1)",21,11,10,32,14,18]
["Diploma en Emergentología (2)",107,53,54,119,59,60]
["Especialización en Emergentología Pediátrica",1,0,1,0,0,0]
["Diploma en Endoscopia Digestiva",8,4,4,1,0,1]
["Diploma en Endoscopia Digestiva Pediátrica",1,0,1,1,0,1]
["Diploma en Endoscopia Digestiva Pediátrica (2)",3,1,2,3,1,2]
["Diploma en Neurodesarrollo",8,1,7,3,1,2]
["Diploma en Neurofisiología Clínica ",2,1,1,0,0,0]
["Diploma en Psicoterapia en Servicios de Salud ",38,6,32,3,0,3]
["Diploma en Salud Pública (1)",1,0,1,1,0,1]
["Diploma en Salud Pública (2)",1,1,0,1,1,0]
["Diploma en Anatomía Patológica Pediátrica",1,0,1,0,0,0]
["Especialización en Adm. en Servicio de la Salud",3,2,1,0,0,0]
["Especialización en Alergología",4,0,4,0,0,0]
["Especialización en Anatomía Patológica",5,2,3,0,0,0]
["Especialización en Anatomía Patológica (1)",0,0,0,0,0,0]
["Especialización en Anestesiología",17,13,4,20,5,15]
["Especialización en Cardiología",19,7,12,14,5,9]
["Especialización en Cirugía Cardíaca ",1,1,0,0,0,0]
["Especialización en Cirugía General",13,3,10,8,6,2]
["Especialización en Cirugía Pedíatrica",2,2,0,2,2,0]
["Especialización en Cirugía Plástica, Reparadora y Estética",1,0,1,8,6,2]
["Especialización en Cirugía Vascular Periférica",2,1,1,1,1,0]
["Especialización en Dermatología Médico Quirúrgica",12,1,11,6,0,6]
["Especialización en Dermatología Médico Quirúrgica (1)",1,0,1,1,0,1]
["Especialización en Endocrinología y Metabolismo",9,1,8,8,0,8]
["Especialización en Enfermedades Infecciosas",1,1,0,1,0,1]
["Especialización en Epidemiología ",0,0,0,1,0,1]
["Especialización en Gastroenterología",11,5,6,10,4,6]
["Especialización en Geriatría",7,0,7,0,0,0]
["Especialización en Gerontopsicomotricidad",3,0,3,0,0,0]
["Especialización en Ginecotocología",24,1,23,22,2,20]
["Especialización en Hematología",5,2,3,6,0,6]
["Especialización en Hemoterapia y Medicina Transfusional",4,1,3,6,0,6]
["Especialización en Imagenología",16,6,10,12,5,7]
["Especialización en Imagenología (1)",1,0,1,1,0,1]
["Especialización en Laboratorio de Patología Clínica",6,1,5,1,0,1]
["Especialización en Laboratorio de Patología Clínica (1)",0,0,0,1,0,1]
["Especialización en Medicina del Deporte",6,3,3,5,3,2]
["Especialización en Medicina Familiar y Comunitaria",21,6,15,5,1,4]
["Especialización en Medicina Familiar y Comunitaria (1)",2,1,1,2,1,1]
["Especialización en Medicina Intensiva",21,8,13,12,5,7]
["Especialización en Medicina Interna",38,9,29,23,6,17]
["Especialización en Medicina Interna (1)",2,0,2,2,0,2]
["Especialización en Medicina Legal (1)",2,0,2,2,0,2]
["Especialización en Microbiología",0,0,0,2,0,2]
["Especialización en Nefrología (1)",0,0,0,2,2,0]
["Especialización en Nefrología ",15,5,10,6,2,4]
["Especialización en Nefrología Pedíatrica ",4,0,4,0,0,0]
["Especialización en Neonatología ",24,4,20,3,0,3]
["Especialización en Neonatología (1)",3,0,3,3,0,3]
["Especialización en Neumología",9,3,6,0,0,0]
["Especialización en Neumología Pediátrica (2)",1,0,1,1,0,1]
["Especialización en Neurocirugía",1,0,1,2,0,2]
["Especialización en Neurología ",8,5,3,3,1,2]
["Especialización en Neuropediatría",3,1,2,2,2,0]
["Especialización en Oftalmología",15,4,11,12,4,8]
["Especialización en Oncología Médica",10,1,9,4,2,2]
["Especialización en Oncología Radioterápica",3,0,3,3,0,3]
["Especialización en Traumatología y Ortopedía",8,6,2,8,7,1]
["Especialización en Otorrinolaringología",6,3,3,5,2,3]
["Especialización en Pediatría",74,16,58,75,7,68]
["Especialización en Psiquiatría",11,1,10,14,3,11]
["Especialización en Psiquiatría Pediátrica",13,2,11,3,1,2]
["Especialización en Salud Ocupacional",14,4,10,1,1,0]
["Especialización en Terapia Intensiva Pediátrica",5,1,4,5,0,5]
["Especialización en Urología",4,2,2,7,5,2]
["Especialización Rehabilitación y Medicina Física",7,3,4,4,1,3]
["Especialización Reumatología",5,3,2,1,0,1]
["Especialización Reumatología (1)",2,0,2,2,0,2]
["Especialización Toxicología Clínica",{"$f":"+C175+D175","v":2},1,1,{"$f":"+F175+G175","v":0},0,0]
["Doctorado en Ciencias Médicas (PROINBIO) ",4,1,3,6,2,4]
["Maestría en Ciencias Médicas (PROINBIO)",39,16,23,2,0,2]
["Diploma en Diabetología",29,7,22,0,0,0]
["Diploma en Diabetología (2)",107,17,90,108,17,91]
["Diploma en Psicoterapia en Servicios de Salud (1)",2,0,2,2,0,2]
["Especialización en Cirugía Torácica",0,0,0,3,0,3]
["Especialización en Medicina Nuclear",1,1,0,2,1,1]
["Especialización en Cirugía Pedíatrica (1)",1,1,0,2,2,0]
["Diploma en Genética Médica - Adultos",1,0,1,0,0,0]
["Diploma en Genética Médica - Pediatría",1,0,1,0,0,0]
["Especialización en Enfermedades Infecciosas (1)",1,1,0,1,1,0]
["Especialización en Hemoterapia y Medicina Transfusional (1)",1,0,1,1,0,1]
["Especialización en Rehabilitación y Medicina Física (1)",1,0,1,1,0,1]
["Diplomatura de Bases Inmunogenéticas de los Transplantes",2,1,1,0,0,0]
["Diploma de Estabilización y Traslado Pediátrico Neonatal (2)",42,13,29,46,16,30]
["Diploma en Hepatología del Adulto (2)",13,5,8,14,5,9]
["Diploma en Medicina Sexual",38,10,28,0,0,0]
["Diploma en Medicina Sexual (2)",9,5,4,9,5,4]
["Diploma en Salud Pública",21,5,16,7,1,6]
[]
["FACULTAD DE ODONTOLOGÍA ",{"$f":"+C196+D196","v":48},{"$f":"SUM(C197:C204)","v":16},{"$f":"SUM(D197:D204)","v":32},{"$f":"+F196+G196","v":15},{"$f":"SUM(F197:F204)","v":10},{"$f":"SUM(G197:G204)","v":5}]
["Especialización en Cirugía y Traumatología Buco Maxilo Facial",5,5,0,3,3,0]
["Especialización en Implantología Oral",14,5,9,5,4,1]
["Especialización en Endodoncia",0,0,0,3,0,3]
["Especialización en Odontopediatría",5,1,4,0,0,0]
["Especialización en Periodoncia",11,2,9,0,0,0]
["Especialización en Odontología Restauradora Integral",13,3,10,0,0,0]
["Especialización en Ortopedia y Ortodoncia Dento Maxilo Facial",0,0,0,3,2,1]
["Especialización en Prostodoncia",0,0,0,1,1,0]
[]
["FACULTAD DE HUMANIDADES Y CIENCIAS DE LA EDUCACIÓN",{"$f":"+C206+D206","v":113},{"$f":"SUM(C207:C220)","v":47},{"$f":"SUM(D207:D220)","v":66},{"$f":"+F206+G206","v":25},{"$f":"SUM(F207:F220)","v":9},{"$f":"SUM(G207:G220)","v":16}]
["Doctorado en Humanidades - Antropología",6,2,4,1,1,0]
["Doctorado en Humanidades - Filosofía",4,4,0,0,0,0]
["Doctorado en Humanidades - Historia",12,7,5,0,0,0]
["Doctorado en Humanidades - Letras",3,1,2,0,0,0]
["Doctorado en Humanidades - Lingüística",5,1,4,0,0,0]
["Doctorado en Humanidades - Educación",14,2,12,0,0,0]
["Maestría en Ciencias Humanas - Antropología de la Cuenca del Plata",7,5,2,2,0,2]
["Maestría en Ciencias Humanas - Filosofía Contemporánea",11,7,4,5,2,3]
["Maestría en Ciencias Humanas - Historia Rioplatense",8,4,4,2,1,1]
["Maestría en Ciencias Humanas - Lenguaje, Cultura y Sociedad",0,0,0,3,1,2]
["Maestría en Ciencias Humanas - Literatura Latinoamericana",5,1,4,5,3,2]
["Maestría en Ciencias Humanas - Teoría e Historia del Teatro",10,3,7,0,0,0]
["Diploma de Posgrado en Ciencias Humanas - Estudios Agrarios Latinoamericanos",28,10,18,0,0,0]
["Maestría en Ciencias Humanas: Estudios Latinoamericanos",0,0,0,7,1,6]
[]
["FACULTAD DE AGRONOMÍA",{"$f":"+C222+D222","v":77},{"$f":"SUM(C223:C227)","v":36},{"$f":"SUM(D223:D227)","v":41},{"$f":"+F222+G222","v":37},{"$f":"SUM(F223:F227)","v":14},{"$f":"SUM(G223:G227)","v":23}]
["Diploma de Especialización en Agronomía",3,1,2,0,0,0]
["Diploma en Desarrollo Rural Sustentable",0,0,0,1,0,1]
["Doctorado en Ciencias Agrarias",16,7,9,10,5,5]
["Maestría en Agronomía",9,4,5,2,2,0]
["Maestría en Ciencias Agrarias",49,24,25,24,7,17]
[]
["FACULTAD DE ARQUITECTURA, DISEÑO Y URBANISMO",{"$f":"+C229+D229","v":45},{"$f":"SUM(C230:C235)","v":14},{"$f":"SUM(D230:D235)","v":31},{"$f":"+F229+G229","v":8},{"$f":"SUM(F230:F235)","v":5},{"$f":"SUM(G230:G235)","v":3}]
["Diploma en Inv. Proyectual",10,6,4,2,0,2]
["Maestría en Construcción de Obras de Arquitectura",1,1,0,1,1,0]
["Maestría en Ordenamiento Territorial y Desarrollo Urbano",33,7,26,3,2,1]
["Maestría en Arquitectura",1,0,1,0,0,0]
["Doctorado en Arquitectura",0,0,0,1,1,0]
["Especialización en Proyecto de Paisaje",0,0,0,1,1,0]
[]
["FACULTAD DE QUÍMICA",{"$f":"+C237+D237","v":35},{"$f":"SUM(C238:C242)","v":10},{"$f":"SUM(D238:D242)","v":25},{"$f":"+F237+G237","v":16},{"$f":"SUM(F238:F242)","v":3},{"$f":"SUM(G238:G242)","v":13}]
["Diploma de Especialización en Farmacia Industrial",1,1,0,0,0,0]
["Doctorado en Química ",25,9,16,11,2,9]
["Diploma de Especialización en Farmacia Hospitalaria",3,0,3,0,0,0]
["Maestría en Química ",4,0,4,5,1,4]
["Diploma de Especialización de Radiofarmacia",2,0,2,0,0,0]
[]
["FACULTAD DE VETERINARIA",{"$f":"+C244+D244","v":35},{"$f":"SUM(C245:C251)","v":11},{"$f":"SUM(D245:D251)","v":24},{"$f":"+F244+G244","v":4},{"$f":"SUM(F245:F251)","v":1},{"$f":"SUM(G245:G251)","v":3}]
["Doctorado en Producción Animal",1,1,0,1,0,1]
["Doctorado en Salud Animal",5,2,3,1,0,1]
["Maestría en Educación y Extensión Rural",6,1,5,0,0,0]
["Maestría en Nutrición de Rumiantes",1,0,1,0,0,0]
["Maestría en Producción Animal",2,1,1,0,0,0]
["Maestría en Reproducción Animal",2,1,1,0,0,0]
["Maestría en Salud Animal",18,5,13,2,1,1]
[]
["FACULTAD DE CIENCIAS",{"$f":"+C253+D253","v":199},{"$f":"SUM(C254:C265)","v":79},{"$f":"SUM(D254:D265)","v":120},{"$f":"+F253+G253","v":95},{"$f":"SUM(F254:F265)","v":33},{"$f":"SUM(G254:G265)","v":62}]
["Doctorado en Ciencias Biológicas (PEDECIBA) (3)",57,22,35,20,9,11]
["Doctorado en Física (PEDECIBA) (3)",10,8,2,2,0,2]
["Doctorado en Matemática (PEDECIBA)",5,4,1,1,0,1]
["Maestría en Biotecnología (3)",10,2,8,8,1,7]
["Maestría en Ciencias Ambientales (3)",6,4,2,2,1,1]
["Maestría en Ciencias Biológicas (PEDECIBA) (3)",53,12,41,45,15,30]
["Maestría en Geociencias (PEDECIBA) (3)",12,8,4,8,1,7]
["Maestría en Matemática (PEDECIBA) (3)",10,8,2,4,4,0]
["Doctorado en Biotecnología",2,0,2,2,1,1]
["Maestría en Física (PEDECIBA) (3)",8,3,5,2,1,1]
["Especialización en Ciencias Ambientales",19,6,13,1,0,1]
["Doctorado en Geociencias (PEDECIBA) (3)",7,2,5,0,0,0]
[]
["FACULTAD DE ENFERMERÍA",{"$f":"+C267+D267","v":232},{"$f":"C268+C285","v":25},{"$f":"D268+D285","v":207},{"$f":"+F267+G267","v":155},{"$f":"F268+F285","v":10},{"$f":"G268+G285","v":145}]
["Montevideo",{"$f":"+C268+D268","v":209},{"$f":"SUM(C269:C284)","v":24},{"$f":"SUM(D269:D284)","v":185},{"$f":"+F268+G268","v":155},{"$f":"SUM(F269:F284)","v":10},{"$f":"SUM(G269:G284)","v":145}]
["Especialización en Enf. Cuidados Intensivos",38,5,33,37,2,35]
["Especialización en Enf. Cuidados Intensivos (1)",1,0,1,1,0,1]
["Maestría en Gestión de Servicios de Salud",0,0,0,6,0,6]
["Especialización en Enfermería en Salud Familiar y Comunitaria",43,6,37,1,0,1]
["Especialización en Enfermería en Salud Familiar y Comunitaria (1)",28,2,26,28,2,26]
["Especialización en Enfermería en Salud Familiar y Comunitaria (2)",13,1,12,13,1,12]
["Especialización en Enfermería en Neonatología",2,0,2,22,1,21]
["Especialización en Enfermería Oncológica",24,1,23,2,0,2]
["Especialización en Enfermería Oncológica (1)",10,0,10,10,0,10]
["Especialización en Enfermería Oncológica (2)",1,1,0,1,1,0]
["Especialización en Nefrología",23,7,16,4,1,3]
["Especialización en Nefrología (1)",16,1,15,16,1,15]
["Maestría en Salud Comunitaria",0,0,0,2,0,2]
["Especialización en Enfermería en Cuidados Intensivos a Niños/as y Adolescentes",7,0,7,6,1,5]
["Especialización en Enfermería en Cuidados Intensivos a Niños/as y Adolescentes (1)",3,0,3,3,0,3]
["Maestría en salud mental",0,0,0,3,0,3]
["Salto",23,{"$f":"C286","v":1},{"$f":"D286","v":22},0,{"$f":"F286","v":0},{"$f":"G286","v":0}]
["Especialización en Enfermería en Salud Familiar y Comunitaria",23,1,22,0,0,0]
[]
["FACULTAD DE PSICOLOGÍA",{"$f":"+C288+D288","v":192},{"$f":"SUM(C289:C296)","v":60},{"$f":"SUM(D289:D296)","v":132},{"$f":"+F288+G288","v":14},{"$f":"SUM(F289:F296)","v":2},{"$f":"SUM(G289:G296)","v":12}]
["Diploma en Psicogerontología",{"$f":"+C289+D289","v":0},0,0,{"$f":"+F289+G289","v":1},0,1]
["Maestría en Psicología Clínica",{"$f":"+C290+D290","v":37},11,26,6,2,4]
["Maestría en Psicología Social",39,11,28,4,0,4]
["Especialización en Psicología del Deporte y la Actividad Física",39,22,17,0,0,0]
["Especialización en Técnicas de Evaluación Psicológica",{"$f":"+C293+D293","v":24},3,21,{"$f":"+F293+G293","v":0},0,0]
["Doctorado en Psicología",{"$f":"+C294+D294","v":6},1,5,{"$f":"+F294+G294","v":0},0,0]
["Maestría en Psicología y Educación",{"$f":"+C295+D295","v":40},10,30,{"$f":"+F295+G295","v":3},0,3]
["Especialización en Servicios de Salud",7,2,5,0,0,0]
[]
["FACULTAD DE INFORMACIÓN Y COMUNICACIÓN (F.I.C.) ",{"$f":"+C298+D298","v":47},{"$f":"SUM(C299:C299)","v":17},{"$f":"SUM(D299:D299)","v":30},{"$f":"+F298+G298","v":2},{"$f":"SUM(F299:F299)","v":1},{"$f":"SUM(G299:G299)","v":1}]
["Maestría en Información y Comunicación",{"$f":"+C299+D299","v":47},17,30,{"$f":"+F299+G299","v":2},1,1]
[]
["ESCUELA DE NUTRICIÓN",{"$f":"+C301+D301","v":0},{"$f":"SUM(C302:C302)","v":0},{"$f":"SUM(D302:D302)","v":0},{"$f":"+F301+G301","v":2},{"$f":"SUM(F302:F302)","v":0},{"$f":"SUM(G302:G302)","v":2}]
["Especialización en Nutrición Enfermedades Crónicas No Transmisibles ",{"$f":"+C302+D302","v":0},0,0,{"$f":"+F302+G302","v":2},0,2]
[]
["Área Social - Comisión Sectorial de Enseñanza",{"$f":"+C304+D304","v":0},{"$f":"C305+C306","v":0},{"$f":"D305+D306","v":0},{"$f":"+F304+G304","v":6},{"$f":"F305+F306","v":2},{"$f":"G305+G306","v":4}]
["Maestría en Enseñanza Universitaria",{"$f":"+C305+D305","v":0},0,0,{"$f":"+F305+G305","v":4},1,3]
["Especialización en Enseñanza Universitaria",{"$f":"+C306+D306","v":0},0,0,{"$f":"+F306+G306","v":2},1,1]
[]
["CCEE y Medicina",{"$f":"+C308+D308","v":16},{"$f":"C309","v":5},{"$f":"D309","v":11},{"$f":"+F308+G308","v":15},{"$f":"F309","v":8},{"$f":"G309","v":7}]
["Posgrado en Especialización en Gestión de Servicios de Salud",{"$f":"+C309+D309","v":16},5,11,{"$f":"+F309+G309","v":15},8,7]
[]
["Ciencias, Ingeniería, Química, PEDECIBA, Instituto de Investigaciones Biológicas Clemente Estable, Instituto Pasteur y ANII",{"$f":"SUM(B312:B312)","v":3},{"$f":"SUM(C312:C312)","v":2},{"$f":"SUM(D312:D312)","v":1},{"$f":"+F311+G311","v":1},{"$f":"SUM(F312:F312)","v":0},{"$f":"SUM(G312:G312)","v":1}]
["Maestría en Bioinformática (PEDECIBA) ",{"$f":"+C312+D312","v":3},2,1,{"$f":"+F312+G312","v":1},0,1]
[]
["Ciencias, Ingeniería, Inst. de Invest. Biológicas Clemente Estable, Inst. Pasteur, PEDECIBA, Química y ANII",{"$f":"SUM(B315:B315)","v":0},{"$f":"SUM(C315:C315)","v":2},{"$f":"SUM(D315:D315)","v":0},{"$f":"+F314+G314","v":0},{"$f":"SUM(F315:F315)","v":0},{"$f":"SUM(G315:G315)","v":0}]
["Diploma de Especialización en Bioinformática",{"$f":"SUM(B316:B316)","v":0},2,0,{"$f":"+F315+G315","v":0},0,0]
[]
["Ciencias Sociales, Derecho, Medicina y Psicología",{"$f":"+C317+D317","v":49},{"$f":"C318+C319","v":7},{"$f":"D318+D319","v":42},{"$f":"+F317+G317","v":9},{"$f":"F318+F319","v":2},{"$f":"G318+G319","v":7}]
["Maestría en Derechos de Infancia y Políticas Públicas",{"$f":"+C318+D318","v":49},7,42,{"$f":"+F318+G318","v":3},1,2]
["Especialización en Derechos de Infancia y Políticas Públicas",{"$f":"+C319+D319","v":0},0,0,{"$f":"+F319+G319","v":6},1,5]
[]
["IPES (ANEP) - UdelaR",{"$f":"+C321+D321","v":112},{"$f":"C322+C330+C331","v":45},{"$f":"D322+D330+D331","v":67},{"$f":"+F321+G321","v":19},{"$f":"F322+F330+F331","v":4},{"$f":"G322+G330+G331","v":15}]
["Montevideo",{"$f":"+C322+D322","v":69},{"$f":"SUM(C323:C328)","v":20},{"$f":"SUM(D323:D328)","v":49},{"$f":"+F322+G322","v":10},{"$f":"SUM(F323:F328)","v":1},{"$f":"SUM(G323:G328)","v":9}]
["Diploma en Didáctica para la Enseñanza Media",{"$f":"+C323+D323","v":0},0,0,{"$f":"+F323+G323","v":1},0,1]
["Diploma en Gestión de Instituciones Educativas",0,0,0,2,1,1]
["Diploma de Posgrado en Geografía",0,0,0,4,0,4]
["Especialización y Maestría en Gramática del Español",0,0,0,2,0,2]
["Diploma en Educación Ambiental",28,9,19,1,0,1]
["Diploma en Gramática del Español",41,11,30,0,0,0]
["Rocha"]
["Diploma en Especialización en Física",43,25,18,3,0,3]
["Salto",0,{"$f":"C332","v":0},{"$f":"D332","v":0},6,{"$f":"F332","v":3},{"$f":"G332","v":3}]
["Diploma en Matemática",0,0,0,6,3,3]
[]
["Ciencias Sociales, Arquitectura, Diseño y Urbanismo, Ciencias, Derecho e Ingeniería",{"$f":"+C334+D334","v":0},{"$f":"C335+C336","v":0},{"$f":"D335+D336","v":0},{"$f":"+F334+G334","v":3},{"$f":"F335+F336","v":1},{"$f":"G335+G336","v":2}]
["Maestría en Manejo Costero Integrado del Cono Sur (Maldonado)",{"$f":"+C335+D335","v":0},0,0,{"$f":"+F335+G335","v":2},1,1]
["Maestría en Manejo Costero Integrado del Cono Sur (Montevideo)",{"$f":"+C336+D336","v":0},0,0,{"$f":"+F336+G336","v":1},0,1]
[]
["Ciencias Económicas, Cs. Sociales y Psicología",{"$f":"+C338+D338","v":9},{"$f":"SUM(C339:C339)","v":4},{"$f":"SUM(D339:D339)","v":5},{"$f":"+F338+G338","v":2},{"$f":"SUM(F339)","v":2},{"$f":"SUM(G339)","v":0}]
["Especialización en Transformación Organizacional",8,4,5,{"$f":"+F339+G339","v":2},2,0]
[]
["Facultades de Ciencias y Agronomía ",{"$f":"+C341+D341","v":6},{"$f":"C342","v":2},{"$f":"D342","v":4},{"$f":"+F341+G341","v":0},{"$f":"F342","v":0},{"$f":"G342","v":0}]
["Maestría en Ciencias Nutricionales (3)",{"$f":"+C342+D342","v":6},2,4,{"$f":"+F342+G342","v":0},0,0]
[]
["Área Social y Artística - Esp. Interdisciplinario",{"$f":"+C344+D344","v":46},{"$f":"C345","v":14},{"$f":"D345","v":32},1,{"$f":"F345","v":1},{"$f":"G345","v":0}]
["Diploma en Gestión Cultural",46,14,32,1,1,0]
[]
["Ciencias, Ingeniería y Psicología",33,{"$f":"C348","v":7},{"$f":"D348","v":26},0,{"$f":"F348","v":0},{"$f":"G348","v":0}]
["Maestría en Ciencias Cognitivas (3)",33,7,26,0,0,0]
[]
["Agronomía y Veterinaria con INAC",{"$f":"+C350+D350","v":28},{"$f":"C351","v":17},{"$f":"D351","v":11},{"$f":"+F350+G350","v":25},{"$f":"F351","v":10},{"$f":"G351","v":15}]
["Especialización en Industria Cárnica",28,17,11,25,10,15]
[]
["Programa APEX - Cerro",{"$f":"+C353+D353","v":9},{"$f":"C354","v":0},{"$f":"D354","v":9},{"$f":"+F353+G353","v":0},{"$f":"F354","v":0},{"$f":"G354","v":0}]
["Especialización en Intervenciones Comunitarias en Salud",9,0,9,0,0,0]
[]
["Ingeniería y Química",{"$f":"+C356+D356","v":17},{"$f":"C357","v":8},{"$f":"D357","v":9},{"$f":"+F356+G356","v":0},{"$f":"F357","v":0},{"$f":"G357","v":0}]
["Diploma de Especialización en Seguridad y Salud en el Trabajo",17,8,9,0,0,0]
[]
["Ciencias Económicas y Ciencias Sociales",{"$f":"+C359+D359","v":0},{"$f":"C360","v":0},{"$f":"D360","v":0},{"$f":"+F359+G359","v":2},{"$f":"F360","v":1},{"$f":"G360","v":1}]
["Maestría en Políticas y Gestión Pública",0,0,0,2,1,1]
[]
["Fuente: Sistema de Gestión de Administración de la Enseñanza (SGAE) y Bedelías de los Servicios Universitarios"]
["Nota:"]
["El dato de Egresos de Posgrado  2017 es PRELIMINAR"]
["(1) Egresos por Competencia Notoria"]
["(2) Egresos por Actuación Documentada"]
["(3) Incluye inscripciones provisorias"]

{"sheet":"II-7.2.6 ","index":91,"n_rows":184,"n_cols":10,"rows_kept":184,"cut":false,"hidden":false,"merged":[[6,2,6,3],[6,5,6,6],[6,8,6,9],[0,5,1,8],[1,2,3,4],[4,0,4,9],[5,0,7,0],[5,1,7,1],[5,2,5,3],[5,4,7,4],[5,5,5,6],[5,7,7,7],[5,8,5,9]]}
["UNIVERSIDADES PRIVADAS: OFERTA DE POSTGRADO",null,null,null,null,"ESTUDIANTES"]
[]
["Cuadro Nº II-7.2.6"]
[]
["ESTUDIANTES INGRESADOS, MATRICULADOS Y EGRESADOS EN PROGRAMAS DE POSTGRADO DE UNIVERSIDADES PRIVADAS POR SEXO SEGÚN UNIVERSIDAD Y ACREDITACIÓN (Todo el país, 2017)"]
["UNIVERSIDAD / ACREDITACIÓN","TOTAL","INGRESADOS",null,"TOTAL","MATRICULADOS",null,"TOTAL","EGRESADOS"]
[null,null,"SEXO",null,null,"SEXO",null,null,"SEXO"]
[null,null,"V","M",null,"V","M",null,"V","M"]
["TOTAL",{"$f":"C9+D9","v":1519},{"$f":"C11+C97+C128+C165","v":564},{"$f":"D11+D97+D128+D165","v":955},{"$f":"F9+G9","v":5194},{"$f":"F11+F97+F128+F165","v":1975},{"$f":"G11+G97+G128+G165","v":3219},{"$f":"I9+J9","v":749},{"$f":"I11+I97+I128+I165","v":258},{"$f":"J11+J97+J128+J165","v":491}]
[]
["UCUDAL ",{"$f":"C11+D11","v":639},{"$f":"C13+C28+C53+C73+C79+C85+C92","v":163},{"$f":"D13+D28+D53+D73+D79+D85+D92","v":476},{"$f":"F11+G11","v":1619},{"$f":"F13+F28+F53+F73+F79+F85+F92","v":400},{"$f":"G13+G28+G53+G73+G79+G85+G92","v":1219},{"$f":"I11+J11","v":283},{"$f":"I13+I28+I53+I73+I79+I85+I92","v":54},{"$f":"J13+J28+J53+J73+J79+J85+J92","v":229}]
[]
["FACULTAD DE CIENCIAS EMPRESARIALES",{"$f":"C13+D13","v":73},{"$f":"SUM(C14:C26)","v":32},{"$f":"SUM(D14:D26)","v":41},{"$f":"F13+G13","v":208},{"$f":"SUM(F14:F26)","v":107},{"$f":"SUM(G14:G26)","v":101},{"$f":"I13+J13","v":46},{"$f":"SUM(I14:I26)","v":17},{"$f":"SUM(J14:J26)","v":29}]
["Maestría En Dirección De Empresas",{"$f":"C14+D14","v":19},11,8,{"$f":"F14+G14","v":67},45,22,{"$f":"I14+J14","v":16},6,10]
["Maestría En Finanzas",7,3,4,18,12,6,{"$f":"I15+J15","v":4},2,2]
["Maestría En Marketing",9,1,8,23,6,17,{"$f":"I16+J16","v":3},0,3]
["Postgrado De Especialización En Dirección De Empresas",23,10,13,25,11,14,1,1,0]
["Postgrado De Especialización En Finanzas",3,1,2,7,3,4,1,1,0]
["Postgrado De Especialización En Marketing",3,2,1,24,6,18,8,0,8]
["Postgrado De Especialización Tributaria",9,4,5,16,7,9,2,1,1]
["Maestría En Dirección De Empresas Con  Énfasis En Marketing",0,0,0,7,6,1,1,1,0]
["Maestría En Dirección De Empresas Con Énfasis En Finanzas",0,0,0,7,4,3,3,2,1]
["Maestría En Dirección De Empresas Con Énfasis En Recursos Humanos",0,0,0,4,3,1,2,1,1]
["Postgrado De  Especialización En Finanzas Con Énfasis En Finanzas Bancarias",0,0,0,1,1,0,0,0,0]
["Postgrado De  Especialización En Finanzas Con Énfasis En Finanzas Corporativas",0,0,0,2,0,2,0,0,0]
["Postgrado De Especialización En Gestión De Recursos Humanos",0,0,0,7,3,4,5,2,3]
[]
["FACULTAD DE CIENCIAS HUMANAS",262,{"$f":"SUM(C29:C51)","v":54},{"$f":"SUM(D29:D51)","v":208},599,{"$f":"SUM(F29:F51)","v":130},{"$f":"SUM(G29:G51)","v":469},128,{"$f":"SUM(I29:I51)","v":25},{"$f":"SUM(J29:J51)","v":103}]
["Maestría En Administración Pública",9,1,8,9,1,8,0,0,0]
["Maestría En Educación Con Énfasis En Gestión Educativa",12,6,6,34,17,17,4,2,2]
["Maestría En Educación Con Énfasis En Orientación Educativa",2,0,2,18,3,15,0,0,0]
["Maestría En Estudios Organizacionales",9,2,7,33,8,25,6,1,5]
["Maestría En Políticas Públicas",16,4,12,74,23,51,5,0,5]
["Postgrado De Especialización En Comunicación Organizacional",22,5,17,38,7,31,5,0,5]
["Postgrado De Especialización En Currículum Y Evaluación",31,7,24,43,10,33,19,4,15]
["Postgrado De Especialización En Dificultades Del Aprendizaje",49,1,48,92,2,90,27,0,27]
["Postgrado De Especialización En Gestión Educativa",65,16,49,128,32,96,27,11,16]
["Postgrado De Especialización En Orientación Educativa",10,2,8,29,5,24,4,0,4]
["Postgrado En Cambio Organizacional",14,5,9,26,7,19,4,2,2]
["Maestría  En Educación Con Énfasis En Dificultades Del Aprendizaje Del Lenguaje Y Del Razonamiento",0,0,0,4,0,4,2,0,2]
["Maestría En Comunicación. Énfasis En Recepción Y Cultura",0,0,0,13,3,10,3,1,2]
["Maestría En Educación Con Énfasis En Dificultades Del Aprendizaje",0,0,0,17,1,16,2,0,2]
["Maestría En Educación Con Énfasis En Gestión De Centros Educativos",0,0,0,4,2,2,2,0,2]
["Postgrado De Especialización En Comunicación Y Cultura",0,0,0,5,0,5,0,0,0]
["Postgrado De Especialización En Estrategias Comunicacionales",0,0,0,9,4,5,8,2,6]
["Maestría En Comunicación Política",0,0,0,0,0,0,1,0,1]
["Maestría En Educación Con Énfasis En Didáctica De Las Matemáticas",0,0,0,0,0,0,2,0,2]
["Maestría En Educación Con Énfasis En Docencia Universitaria",0,0,0,0,0,0,1,0,1]
["Maestría En Evaluación De Sistemas Educativos",0,0,0,0,0,0,3,0,3]
["Postgrado De Especialización En Currículum Y Evaluación",6,1,5,6,1,5,0,0,0]
["Postgrado De Especialización En Gestión Educativa",17,4,13,17,4,13,3,2,1]
[]
["FACULTAD DE PSICOLOGÍA",142,{"$f":"SUM(C54:C71)","v":23},{"$f":"SUM(D54:D71)","v":119},455,{"$f":"SUM(F54:F71)","v":61},{"$f":"SUM(G54:G71)","v":394},54,{"$f":"SUM(I54:I71)","v":5},{"$f":"SUM(J54:J71)","v":49}]
["Doctorado En Psicología",1,0,1,9,1,8,2,0,2]
["Especialización En Diabetología",24,7,17,28,8,20,8,2,6]
["Maestría En Atención Temprana",13,0,13,26,0,26,0,0,0]
["Maestría En Intervención Psicopedagógica",9,0,9,16,0,16,2,0,2]
["Maestría En Psicología Clínica Familiar Sistémica",11,1,10,11,1,10,0,0,0]
["Maestría En Psicología Clínica, Opción Niños Y Adolescentes",28,3,25,56,9,47,2,0,2]
["Maestría En Psicología Educacional",4,0,4,36,7,29,3,0,3]
["Maestría En Psicoterapia - Orientación Psicología Analítica Junguiana",13,3,10,40,13,27,2,1,1]
["Postgrado De Especialización Académica En Psicología Analítica",5,2,3,8,3,5,2,0,2]
["Postgrado De Especialización En Psicología Clínica Orientación Psicología Cognitiva",14,2,12,42,7,35,6,1,5]
["Postgrado De Especialización En Psicología Infantil Y Del Adolescente",9,2,7,50,3,47,5,1,4]
["Postgrado De Especialización: Integración En Salud Desde La Psiconeuroinmunoendocrinología",4,1,3,42,5,37,6,0,6]
["Postgrado En Psicología Educacional",7,2,5,49,2,47,7,0,7]
["Especialización En Psicología Sistémica Y Familias",0,0,0,6,0,6,2,0,2]
["Maestría En Psicología Clínica Cognitiva",0,0,0,1,0,1,1,0,1]
["Postgrado De Especialización En Drogodependencia",0,0,0,4,0,4,1,0,1]
["Postgrado De Especialización En Intervención Psicosocial",0,0,0,1,0,1,2,0,2]
["Postgrado De Especialización En Psicología Del Trabajo Y Las Organizaciones",0,0,0,30,2,28,3,0,3]
[]
["FACULTAD DE ENFERMERÍA Y TECNOLOGÍAS DE LA SALUD",38,{"$f":"SUM(C74:C77)","v":5},{"$f":"SUM(D74:D77)","v":33},158,{"$f":"SUM(F74:F77)","v":18},{"$f":"SUM(G74:G77)","v":140},44,{"$f":"SUM(I74:I77)","v":3},{"$f":"SUM(J74:J77)","v":41}]
["Maestría En Nutrición",4,0,4,1,0,1,8,1,7]
["Postgrado De Especialización En Gestión De Servicios De Salud",34,5,29,108,11,97,31,2,29]
["Maestría Profesional En Cuidados Paliativos",0,0,0,15,2,13,0,0,0]
["Postgrado De Especialización En Enfermería En Cuidados Intensivos Del Adulto",0,0,0,34,5,29,5,0,5]
[]
["FACULTAD DE ODONTOLOGÍA",52,{"$f":"SUM(C80:C83)","v":11},{"$f":"SUM(D80:D83)","v":41},52,{"$f":"SUM(F80:F83)","v":10},{"$f":"SUM(G80:G83)","v":42},1,{"$f":"SUM(I80:I83)","v":0},{"$f":"SUM(J80:J83)","v":1}]
["Postgrado De Especialización En Cirugía Para Implantes Y Prótesis Implanto-Asisitidas",14,5,9,5,2,3,1,0,1]
["Postgrado De Especialización En Endodoncia",9,1,8,9,1,8,0,0,0]
["Postgrado De Especialización En Ortodoncia Y Ortopedia Buco Maxilofacial",29,5,24,27,4,23,0,0,0]
["Postgrado De Especialización En Odontología Restauradora Y Prostodoncia Fija",0,0,0,11,3,8,0,0,0]
[]
["FACULTAD DE INGENIERÍA Y TECNOLOGÍAS ",16,{"$f":"SUM(C86:C90)","v":11},{"$f":"SUM(D86:D90)","v":5},74,{"$f":"SUM(F86:F90)","v":44},{"$f":"SUM(G86:G90)","v":30},8,{"$f":"SUM(I86:I90)","v":3},{"$f":"SUM(J86:J90)","v":5}]
["Maestría En Ciencias De La Ingeniería Eléctrica",2,2,0,4,4,0,0,0,0]
["Maestría En Gerencia De La Energía",5,3,2,22,16,6,2,1,1]
["Maestría En Gerencia De Tecnologías De La Información",7,5,2,30,21,9,3,2,1]
["Postgrado De Especialización En Tecnología De Los Alimentos",2,1,1,15,2,13,3,0,3]
["Maestría En Tecnología Y Gestión De La Industria De Alimentos",{"$f":"C90+D90","v":0},0,0,{"$f":"F90+G90","v":3},1,2,0,0,0]
[]
["FACULTAD DE DERECHO",56,{"$f":"SUM(C93:C95)","v":27},{"$f":"SUM(D93:D95)","v":29},73,{"$f":"SUM(F93:F95)","v":30},{"$f":"SUM(G93:G95)","v":43},{"$f":"I92+J92","v":2},{"$f":"SUM(I93:I95)","v":1},{"$f":"SUM(J93:J95)","v":1}]
["Maestría En Derecho Con Énfasis En Derecho Constitucional Y Derechos Humanos",24,12,12,12,6,6,1,0,1]
["Maestría En Derecho Procesal Penal",13,7,6,13,7,6,0,0,0]
["Maestría En Derecho, Énfasis En Derecho Civil Contractual",19,8,11,48,17,31,1,1,0]
[]
["UNIVERSIDAD ORT URUGUAY",213,{"$f":"C99+C113+C117+C120","v":102},{"$f":"D99+D113+D117+D120","v":111},716,{"$f":"F99+F113+F117+F120","v":292},{"$f":"G99+G113+G117+G120","v":424},214,{"$f":"I99+I113+I117+I120","v":74},{"$f":"J99+J113+J117+J120","v":140}]
[]
["FACULTAD DE ADMINISTRACIÓN Y CIENCIAS SOCIALES",133,{"$f":"SUM(C100:C111)","v":66},{"$f":"SUM(D100:D111)","v":67},485,{"$f":"SUM(F100:F111)","v":205},{"$f":"SUM(G100:G111)","v":280},144,{"$f":"SUM(I100:I111)","v":61},{"$f":"SUM(J100:J111)","v":83}]
["Diploma de Especialización en Recursos Humanos",17,3,14,49,8,41,10,1,9]
["Diploma de Especialización en Finanzas",7,3,4,22,11,11,7,3,4]
["Master en Administración de Empresas",30,19,11,113,66,47,44,24,20]
["Master en Dirección de Recursos Humanos",8,3,5,46,8,38,10,0,10]
["Master en Dirección Financiera",10,6,4,30,20,10,2,1,1]
["Diploma de Especialización en Impuestos",17,4,13,74,24,50,20,9,11]
["Diploma de Especialización en Dirección de Marketing",18,11,7,42,20,22,17,7,10]
["Diploma de Especialización en Contabilidad",6,2,4,36,9,27,9,1,8]
["Master en Impuestos y Normas de Contabilidad - NIIF",12,10,2,28,13,15,8,2,6]
["Master en Economía",0,0,0,6,5,1,1,1,0]
["Master en Gerencia de Empresas Tecnológicas TIC",0,0,0,20,14,6,16,12,4]
["Master en Contabilidad y Finanzas",8,5,3,19,7,12,0,0,0]
[]
["FACULTAD DE INGENIERÍA",30,{"$f":"C114+C115","v":26},{"$f":"D114+D115","v":4},43,{"$f":"F114+F115","v":38},{"$f":"G114+G115","v":5},0,{"$f":"I114+I115","v":0},{"$f":"J114+J115","v":0}]
["Master en Ingeniería",5,5,0,18,17,1,0,0,0]
["Diploma de Especialización en Analítica de Big Data",25,21,4,25,21,4,0,0,0]
[]
["FACULTAD DE ARQUITECTURA",14,{"$f":"C118","v":4},{"$f":"D118","v":10},36,{"$f":"F118","v":17},{"$f":"G118","v":19},17,{"$f":"I118","v":5},{"$f":"J118","v":12}]
["Diploma de Especialización en Negocios Inmobiliarios",14,4,10,36,17,19,17,5,12]
[]
["INSTITUTO DE EDUCACIÓN",36,{"$f":"SUM(C121:C126)","v":6},{"$f":"SUM(D121:D126)","v":30},152,{"$f":"SUM(F121:F126)","v":32},{"$f":"SUM(G121:G126)","v":120},53,{"$f":"SUM(I121:I126)","v":8},{"$f":"SUM(J121:J126)","v":45}]
["Diploma en Educación (a distancia)",0,0,0,0,0,0,11,1,10]
["Master en Educación",18,4,14,75,14,61,16,2,14]
["Diploma en Planificación y Gestión Educativa (a distancia)",0,0,0,5,0,5,23,5,18]
["Master en Gestión Educativa",1,0,1,33,11,22,0,0,0]
["Doctorado en Educación",0,0,0,22,5,17,3,0,3]
["Master en Formación de Formadores",17,2,15,17,2,15,0,0,0]
[]
["UNIVERSIDAD DE MONTEVIDEO",245,{"$f":"C130+C135+C142+C147+C154+C157+C161","v":115},{"$f":"D130+D135+D142+D147+D154+D157+D161","v":130},1368,{"$f":"F130+F135+F142+F147+F154+F157+F161","v":648},{"$f":"G130+G135+G142+G147+G154+G157+G161","v":720},208,{"$f":"I130+I135+I142+I147+I154+I157+I161","v":106},{"$f":"J130+J135+J142+J147+J154+J157+J161","v":102}]
[]
["FACULTAD DE CIENCIAS EMPRESARIALES Y ECONOMÍA",35,{"$f":"C131+C132+C133","v":14},{"$f":"D131+D132+D133","v":21},261,{"$f":"F131+F132+F133","v":115},{"$f":"G131+G132+G133","v":146},15,{"$f":"I131+I132+I133","v":7},{"$f":"J131+J132+J133","v":8}]
["Maestría en Economía",5,2,3,56,30,26,0,0,0]
["Maestría en Finanzas",14,7,7,117,62,55,14,6,8]
["Maestría en Contabilidad y Técnica Tributaria",16,5,11,88,23,65,1,1,0]
[]
["FACULTAD DE DERECHO",38,{"$f":"SUM(C136:C140)","v":15},{"$f":"SUM(D136:D140)","v":23},312,{"$f":"SUM(F136:F140)","v":128},{"$f":"SUM(G136:G140)","v":184},27,{"$f":"SUM(I136:I140)","v":11},{"$f":"SUM(J136:J140)","v":16}]
["Maestría en Derecho LL M",18,4,14,107,42,65,0,0,0]
["Maestría en Derecho Administrativo Económico",5,5,0,36,20,16,4,2,2]
["Maestría en Derecho de la Empresa",0,0,0,37,13,24,4,0,4]
["Maestría en Tributación",13,5,8,105,42,63,15,7,8]
["Maestría en Integración y Comercio Internacinal",2,1,1,27,11,16,4,2,2]
[]
["INSTITUTO DE ESTUDIOS EMPRESARIALES",117,{"$f":"SUM(C143:C145)","v":74},{"$f":"SUM(D143:D145)","v":43},489,{"$f":"SUM(F143:F145)","v":298},{"$f":"SUM(G143:G145)","v":191},121,{"$f":"SUM(I143:I145)","v":74},{"$f":"SUM(J143:J145)","v":47}]
["Maestría Profesional en Dirección y Administración de Empresas",96,63,33,394,252,142,98,62,36]
["Maestría en Dirección de Empresas de Salud",21,11,10,77,43,34,21,12,9]
["Maestría en Gestión Humana",0,0,0,18,3,15,2,0,2]
[]
["CENTRO DE CIENCIAS BIOMÉDICAS",30,{"$f":"SUM(C148:C152)","v":10},{"$f":"SUM(D148:D152)","v":20},192,{"$f":"SUM(F148:F152)","v":72},{"$f":"SUM(G148:G152)","v":120},13,{"$f":"SUM(I148:I152)","v":6},{"$f":"SUM(J148:J152)","v":7}]
["Especialización en Medicina de Emergencia",18,7,11,104,36,68,6,2,4]
["Especialización en Traumatología y Ortopedia",2,1,1,26,22,4,4,4,0]
["Maestría en Medicina Familiar y Comunitaria",6,0,6,34,6,28,3,0,3]
["Especialización en Mastología",4,2,2,16,7,9,0,0,0]
["Maestría en Farmacología Clinica",0,0,0,12,1,11,0,0,0]
[]
["FACULTAD DE HUMANIDADES",{"$f":"C154+D154","v":0},{"$f":"C155","v":0},{"$f":"D155","v":0},{"$f":"F154+G154","v":27},{"$f":"F155","v":14},{"$f":"G155","v":13},{"$f":"I154+J154","v":5},{"$f":"I155","v":3},{"$f":"J155","v":2}]
["Maestría en Historia",0,0,0,27,14,13,5,3,2]
[]
["FACULTAD DE COMUNICACIÓN",24,{"$f":"C158+C159","v":2},{"$f":"D158+D159","v":22},74,{"$f":"F158+F159","v":12},{"$f":"G158+G159","v":62},27,{"$f":"I158+I159","v":5},{"$f":"J158+J159","v":22}]
["Maestría en Estudios Latinoamericanos",0,0,0,1,0,1,0,0,0]
["Maestría en Dirección de Comunicación",24,2,22,73,12,61,27,5,22]
[]
["FACULTAD DE INGENIERÍA",1,{"$f":"C162+C163","v":0},{"$f":"D162+D163","v":1},13,{"$f":"F162+F163","v":9},{"$f":"G162+G163","v":4},0,{"$f":"I162+I163","v":0},{"$f":"J162+J163","v":0}]
["Especialización en Producción mas Limpia",0,0,0,7,6,1,0,0,0]
["Maestría en Investigación aplicada a la Ingeniería",1,0,1,6,3,3,0,0,0]
[]
["UNIVERSIDAD DE LA EMPRESA",422,{"$f":"C167+C171+C175+C178","v":184},{"$f":"D167+D171+D175+D178","v":238},1491,{"$f":"F167+F171+F175+F178","v":635},{"$f":"G167+G171+G175+G178","v":856},44,{"$f":"I167+I171+I175+I178","v":24},{"$f":"J167+J171+J175+J178","v":20}]
[]
["FACULTAD DE CIENCIAS EMPRESARIALES ",61,{"$f":"SUM(C168:C169)","v":36},{"$f":"SUM(D168:D169)","v":25},393,{"$f":"SUM(F168:F169)","v":222},{"$f":"SUM(G168:G169)","v":171},7,{"$f":"SUM(I168:I169)","v":5},{"$f":"SUM(J168:J169)","v":2}]
["Maestría en Dirección y Administración de Empresas ",53,31,22,359,202,157,7,5,2]
["Maestría en Marketing y Dirección Comercial",8,5,3,34,20,14,0,0,0]
[]
["FACULTAD DE CIENCIAS JURIDÍCAS",129,{"$f":"C172+C173","v":57},{"$f":"D172+D173","v":72},263,{"$f":"F172+F173","v":137},{"$f":"G172+G173","v":126},1,{"$f":"I172+I173","v":1},{"$f":"J172+J173","v":0}]
["Maestría en Cencias Criminológico Forences",74,30,44,101,46,55,1,1,0]
["Masestría en Derecho de las Relaciones Internacionales",55,27,28,162,91,71,0,0,0]
[]
["FACULTAD DE CIENCIAS DE LA  EDUCACIÓN",182,{"$f":"C176","v":62},{"$f":"D176","v":120},785,{"$f":"F176","v":247},{"$f":"G176","v":538},3,{"$f":"I176","v":0},{"$f":"J176","v":3}]
["Maestría en Educación",182,62,120,785,247,538,3,0,3]
[]
["FACULTAD DE CIENCIAS AGRARIAS",50,{"$f":"C179+C180+C181","v":29},{"$f":"D179+D180+D181","v":21},50,{"$f":"F179+F180+F181","v":29},{"$f":"G179+G180+G181","v":21},33,{"$f":"I179+I180+I181","v":18},{"$f":"J179+J180+J181","v":15}]
["Diploma en Administración de Agronegocios",9,6,3,9,6,3,7,5,2]
["Diploma en Gestión y Comercialización de Granos",15,5,10,15,5,10,15,5,10]
["Diploma en Producción Animal",26,18,8,26,18,8,11,8,3]
[]
[]
["Fuente: Oficinas Productoras de cada una de las Instituciones. "]

{"sheet":"II-7.2.7  ","index":92,"n_rows":57,"n_cols":10,"rows_kept":57,"cut":false,"hidden":false,"merged":[[6,5,6,6],[6,8,6,9],[58,0,58,5],[0,5,1,8],[4,0,4,9],[5,0,7,0],[5,1,7,1],[5,2,5,3],[5,4,7,4],[5,5,5,6],[5,7,7,7],[5,8,5,9],[6,2,6,3]]}
["INSTITUTOS UNIVERSITARIOS: OFERTA DE POSTGRADO",null,null,null,null,"ESTUDIANTES"]
[]
["Cuadro Nº II-7.2.7"]
[]
["ESTUDIANTES INGRESADOS, MATRICULADOS Y EGRESADOS EN PROGRAMAS DE POSTGRADO DE INSTITUTOS UNIVERSITARIOS POR SEXO SEGÚN INSTITUTO UNIVERSITARIO Y ACREDITACIÓN (Todo el país, 2017)"]
["INSTITUTO UNIVERSITARIO / ACREDITACIÓN","TOTAL","INGRESADOS",null,"TOTAL","MATRICULADOS",null,"TOTAL","EGRESADOS"]
[null,null,"SEXO",null,null,"SEXO",null,null,"SEXO"]
[null,null,"V","M",null,"V","M",null,"V","M"]
["TOTAL",{"$f":"SUM(C9:D9)","v":912},{"$f":"C11+C27+C30+C33+C37+C41+C47+C55","v":510},{"$f":"D11+D27+D30+D33+D37+D41+D47+D55","v":402},{"$f":"SUM(F9:G9)","v":1143},{"$f":"F11+F27+F30+F33+F37+F41+F47+F55","v":615},{"$f":"G11+G27+G30+G33+G37+G41+G47+G55","v":528},{"$f":"SUM(I9:J9)","v":433},{"$f":"I11+I27+I30+I33+I37+I41+I47+I55","v":360},{"$f":"J11+J27+J30+J33+J37+J41+J47+J55","v":73}]
[]
["INST UNIV CLAEH ",{"$f":"+C11+D11","v":102},{"$f":"SUM(C12:C25)","v":32},{"$f":"SUM(D12:D25)","v":70},{"$f":"+F11+G11","v":223},{"$f":"SUM(F12:F25)","v":75},{"$f":"SUM(G12:G25)","v":148},{"$f":"I11+J11","v":49},{"$f":"SUM(I12:I25)","v":14},{"$f":"SUM(J12:J25)","v":35}]
["Especialización en Didáctica de la Historia",{"$f":"+C12+D12","v":11},4,7,{"$f":"+F12+G12","v":11},4,7,{"$f":"+I12+J12","v":0},0,0]
["Especialización en Gestion de Servicios de  Salud",31,9,22,80,25,55,11,6,5]
["Especialización en Didácticas de la Educación Básica",3,0,3,8,0,8,0,0,0]
["Especialización en Docencia de la Educación Media",4,1,3,15,5,10,2,1,1]
["Especialización en Didáctica de la Educación Superior",19,4,15,37,13,24,12,3,9]
["Especialización en Tecnología Educativa",7,4,3,13,7,6,7,2,5]
["Maestria en Tecnología Educativa",0,0,0,6,1,5,1,0,1]
["Maestría en Docencia de la Educación Media",0,0,0,3,1,2,4,1,3]
["Maestría en Didáctica de la Educación Superior",0,0,0,9,3,6,2,0,2]
["Maestría en Política y Gestión de la Salud",0,0,0,0,0,0,1,0,1]
["Especialización en Historia del Arte y Patrimonio",18,7,11,41,16,25,0,0,0]
["Especialización en Política y Gestión de la Educación",9,3,6,0,0,0,0,0,0]
["Maestría en Política y Gestión de la Educación",0,0,0,0,0,0,8,1,7]
["Maestría en Didáctica de la Educación Básica",0,0,0,0,0,0,1,0,1]
[]
["INSTITUTO UNIVERSITARIO DE POSTGRADO EN PSICOANÁLISIS (IUPP) ",{"$f":"+C27+D27","v":9},{"$f":"SUM(C28)","v":1},{"$f":"SUM(D28)","v":8},{"$f":"+F27+G27","v":32},{"$f":"SUM(F28)","v":7},{"$f":"SUM(G28)","v":25},{"$f":"+I27+J27","v":4},{"$f":"SUM(I28)","v":1},{"$f":"SUM(J28)","v":3}]
["Maestría en Psicoanálisis",{"$f":"+C28+D28","v":9},1,8,{"$f":"+F28+G28","v":32},7,25,{"$f":"+I28+J28","v":4},1,3]
[]
["INSTITUTO UNIVERSITARIO CENTRO DE ESTUDIO Y DIAGNOSTICO DE LAS DISGNANCIAS DEL URUGUAY (IUCEDDU)",{"$f":"+C30+D30","v":8},{"$f":"C31","v":0},{"$f":"D31","v":8},{"$f":"+F30+G30","v":29},{"$f":"F31","v":9},{"$f":"G31","v":20},{"$f":"+I30+J30","v":4},{"$f":"I31","v":1},{"$f":"J31","v":3}]
["Especialización en Ortopedia y Ortodoncia maxilo-Facial",8,0,8,29,9,20,4,1,3]
[]
["INST UNIV ASOCIACIÓN CRISTIANA DE JÓVENES",{"$f":"+C33+D33","v":18},{"$f":"C34+C35","v":8},{"$f":"D34+D35","v":10},{"$f":"+F33+G33","v":59},{"$f":"F34+F35","v":48},{"$f":"G34+G35","v":11},{"$f":"+I33+J33","v":0},{"$f":"I34+I35","v":0},{"$f":"J34+J35","v":0}]
["Maestría en Alto Rendimiento en Deportes de Equipo (Maldonado)",0,0,0,41,38,3,0,0,0]
["Maestría en Educación Física y Deporte (Montevideo)",18,8,10,18,10,8,0,0,0]
[]
["Centro de Altos Estudios Nacionales (CALEN)",{"$f":"+C37+D37","v":40},{"$f":"C38+C39","v":27},{"$f":"D38+D39","v":13},{"$f":"+F37+G37","v":40},{"$f":"F38+F39","v":27},{"$f":"G38+G39","v":13},{"$f":"+I37+J37","v":24},{"$f":"I38+I39","v":15},{"$f":"J38+J39","v":9}]
["Maestria en Estrategia Nacional. 1º Año",{"$f":"+C38+D38","v":12},9,3,{"$f":"+F38+G38","v":12},9,3,{"$f":"+I38+J38","v":17},11,6]
["Maestria en Estrategia Nacional.2º Año",{"$f":"+C39+D39","v":28},18,10,{"$f":"+F39+G39","v":28},18,10,7,4,3]
[]
["Escuela de Guerra Naval (ESGUE)",{"$f":"C41+D41","v":118},{"$f":"SUM(C42:C45)","v":107},{"$f":"SUM(D42:D45)","v":11},{"$f":"F41+G41","v":118},{"$f":"SUM(F42:F45)","v":107},{"$f":"SUM(G42:G45)","v":11},{"$f":"I41+J41","v":63},{"$f":"SUM(I42:I45)","v":57},{"$f":"SUM(J42:J45)","v":6}]
["Curso de Pasaje de Grado de TTNN para CCCC",56,50,6,{"$f":"F42+G42","v":56},50,6,24,20,4]
["Curso de Pasaje de Grado de AANN para TTNN",38,33,5,{"$f":"F43+G43","v":38},33,5,20,18,2]
["Curso de Pasaje de Grado de CCCC para CCFF",16,16,0,{"$f":"F44+G44","v":16},16,0,10,10,0]
["Curso Estado Mayor Naval",8,8,0,{"$f":"F45+G45","v":8},8,0,9,9,0]
[]
["Instituto de Perfeccionamiento y Estudios Superiores -IPES",339,{"$f":"SUM(C48:C53)","v":66},{"$f":"SUM(D48:D53)","v":273},{"$f":"F47+G47","v":364},{"$f":"SUM(F48:F53)","v":73},{"$f":"SUM(G48:G53)","v":291},11,{"$f":"SUM(I48:I53)","v":3},{"$f":"SUM(J48:J53)","v":8}]
["Posgrado de Dificultades de Aprendizaje",80,3,77,91,1,90,0,0,0]
["Posgrados Matemática",39,14,25,39,14,25,6,3,3]
["Especialización y Maestría en Gramática del español",43,4,39,52,13,39,2,0,2]
["Diploma de Especialización en Física",46,24,22,43,25,18,3,0,3]
["Maestría en Educación Ambiental",28,9,19,31,9,22,0,0,0]
["Maestría en Educación, Sociedad y Política ",103,12,91,108,11,97,0,0,0]
[]
["Escuela Naval",{"$f":"C55+D55","v":278},{"$f":"SUM(C56:C56)","v":269},{"$f":"SUM(D56:D56)","v":9},{"$f":"F55+G55","v":278},{"$f":"SUM(F56:F56)","v":269},{"$f":"SUM(G56:G56)","v":9},{"$f":"I55+J55","v":278},{"$f":"SUM(I56:I56)","v":269},{"$f":"SUM(J56:J56)","v":9}]
["CURSOS OMI (ORGANIZACIÓN MARITIMA INTERNACIONAL)",278,269,9,278,269,9,278,269,9]
["Fuente: Oficinas Productoras de cada una de las Instituciones. "]

{"sheet":"II-7.2.8","index":93,"n_rows":48,"n_cols":19,"rows_kept":48,"cut":false,"hidden":false,"merged":[[44,0,44,8],[0,0,0,2],[0,4,1,5],[2,0,2,16],[4,1,4,16],[43,0,43,8],[45,0,45,8],[46,0,46,8],[46,9,46,11],[47,0,47,8],[47,9,47,11]]}
["Ministerio de Educación y Cultura\nDirección de Educación\n",null,null,null,"ESTUDIANTES"]
[]
["Cuadro II-7.2.8"]
["EVOLUCIÓN DE LA MATRÍCULA DE LAS INSTITUCIONES UNIVERSITARIAS (Todo el país, 2000 – 2017)."]
["INSTITUCIONES","AÑO LECTIVO"]
["UNIVERSITARIAS",2000,2001,2002,2003,2004,2005,2006,2007,2008,2009,2010,2011,2012,2013,2014,2015,2016,2017]
[]
["TOTAL  ",{"$f":"B10+B23","v":82932},{"$f":"C10+C23","v":88538},93462,98700,103941,115096,123020,131000,136304,138574,{"$f":"L10+L23","v":145795},{"$f":"M10+M23+M39","v":151169},155916,159788,163322,{"$f":"Q10+Q23+Q39","v":166622},{"$f":"R10+R23+R39","v":170462},{"$f":"S10+S23+S39","v":173597}]
[]
["Total Universidades   ",{"$f":"B12+B18","v":82717},88200,93054,98287,103348,113698,121371,129122,133535,136284,143233,148133,153627,157511,161200,{"$f":"Q12+Q18","v":164341},{"$f":"R12+R18","v":168129},{"$f":"S12+S18","v":170554}]
[]
["Universidades Públicas",{"$f":"B14+B16","v":74454},{"$f":"C14+C16","v":79016},83857,88994,94447,100233,106374,112891,116290,119791,123398,127114,130941,{"$f":"O14+O16","v":133911},{"$f":"P14+P16","v":136993},{"$f":"Q14+Q16","v":139923},{"$f":"R14+R16","v":142569},{"$f":"S14+S16","v":145069}]
[]
["UdelaR **",74454,79016,83857,88994,94447,100233,106374,112891,116290,119791,123398,127114,130941,133911,136938,139754,142211,144348]
[]
["UTEC",null,null,null,null,null,null,null,null,null,null,null,null,null,null,55,169,358,721]
[]
["Universidades Privadas  ",8263,9184,9197,9293,{"$f":"SUM(F19:F22)","v":8901},13465,14997,16231,17245,16493,19835,21019,22686,{"$f":"SUM(O19:O22)","v":23600},{"$f":"SUM(P19:P22)","v":24207},{"$f":"SUM(Q19:Q22)","v":24418},{"$f":"SUM(R19:R22)","v":25560},{"$f":"SUM(S19:S22)","v":25485}]
["Univ Católica del Uruguay  ",4057,4180,3591,3849,3286,5580,5911,6401,7126,7227,7996,{"$f":"6655+2244","v":8899},9478,9402,9349,9496,9373,8510]
["Univ ORT Uruguay  ",3445,3572,3900,3777,3827,5674,5863,6118,6442,7202,7199,{"$f":"6991+631","v":7622},7511,8208,8345,8194,8065,7837]
["Univ de la Empresa ",0,609,909,790,872,911,1611,1756,1739,2064,2465,{"$f":"1667+472","v":2139},3475,3743,4155,4134,4069,4970]
["Univ de Montevideo  ",575,775,749,824,916,1300,1612,1956,1938,null,2175,{"$f":"1780+579","v":2359},2222,2247,2358,2594,4053,4168]
["Total Institutos Universitarios  ",{"$f":"SUM(B24:B34)","v":215},338,408,413,593,1398,1649,1878,2769,2290,2562,2930,2132,2132,1937,{"$f":"SUM(Q24:Q36)","v":2121},{"$f":"SUM(R24:R36)","v":1924},{"$f":"SUM(S24:S38)","v":2607}]
["IU Autónomo del Sur ",215,211,218,184,195,318,428,414,428,515,605,691,"n/c","n/c","n/c","n/c","n/c","n/c"]
["IU Asoc Cristiana de Jóvenes ",0,93,140,141,184,407,508,449,352,346,427,515,587,639,603,520,615,609]
["IU CLAEH ",0,0,0,39,91,283,412,483,483,740,651,{"$f":"354+352","v":706},532,607,679,680,515,670]
["IU Monseñor Mariano Soler ",0,0,0,0,59,65,50,83,54,50,42,61,61,59,64,70,71,59]
["IU Asoc Psico del Uruguay",0,0,0,0,35,25,31,29,34,38,40,48,42,45,35,41,34,32]
["IU Crandon ",0,0,0,0,29,60,59,72,21,89,78,{"$f":"48+9","v":57},48,41,20,20,51,36]
["IU San Francisco de Asis ",0,0,0,0,0,83,161,202,202,237,380,489,441,435,393,437,433,434]
["IU Bios",0,0,0,0,0,157,0,146,178,112,109,94,68,"n/c","n/c","n/c","n/c","n/c"]
["IU Maldonado-Punta del Este","n/c","n/c","n/c","n/c","n/c","n/c","n/c","n/c",1017,"n/c","n/c","n/c","n/c","n/c","n/c","n/c","n/c","n/c"]
["Fundación Politécnico Punta del Este","n/c","n/c","n/c","n/c","n/c","n/c","n/c","n/c","n/c","n/c","n/c","n/c",42,41,39,41,32,35]
["IU CEDIIAP ",0,34,50,49,0,0,0,0,0,163,230,{"$f":"227+42","v":269},311,265,104,89,107,100]
["IUCEDDU",null,null,null,null,null,null,null,null,null,null,null,null,null,null,null,34,41,29]
["IPES",null,null,null,null,null,null,null,null,null,null,null,null,null,null,null,189,25,364]
["Instituto Universitario Elbio Fernández",null,null,null,null,null,null,null,null,null,null,null,null,null,null,null,null,null,64]
["Escuela de Formación Profesional en Comercio Exterior y Aduana",null,null,null,null,null,null,null,null,null,null,null,null,null,null,null,null,null,175]
["Total Área Seguridad y Defensa","n/c","n/c","n/c","n/c","n/c","n/c","n/c","n/c","n/c","n/c","n/c",{"$f":"SUM(M40:M51)","v":106},{"$f":"SUM(N40:N51)","v":157},{"$f":"SUM(O40:O43)","v":145},{"$f":"SUM(P40:P43)","v":185},{"$f":"SUM(Q40:Q43)","v":160},{"$f":"SUM(R40:R43)","v":409},{"$f":"SUM(S40:S43)","v":436}]
["Escuela Nacional de Policía *","n/c","n/c","n/c","n/c","n/c","n/c","n/c","n/c","n/c","n/c","n/c","s/d",77,52,27,"-","-","-"]
["Escuela Naval","n/c","n/c","n/c","n/c","n/c","n/c","n/c","n/c","n/c","n/c","n/c","s/d",25,"s/d","s/d","s/d",240,278]
["CALEN","n/c","n/c","n/c","n/c","n/c","n/c","n/c","n/c","n/c","n/c","n/c",106,55,62,49,43,59,40]
["Escuela de Guerra Naval",null,null,null,null,null,null,null,null,null,null,null,null,null,31,109,117,110,118]
["Fuentes: Oficinas productoras de cada una de las instituciones"]
[" (**) Proyección de Matrícula de Estudiantes de Grado de la UdelaR (División de Estadística, año 2017). (Incluye carreras técnicas, tecnológicas y de grado)."]
["Las Universidades privadas e Institutos Universitarios incluyen grado y postgrado. "]
["* En la Escuela Nacional de Policía durante el 2017 no se dictó  la Licenciatura en Seguridad Pública"]
["Escuela Naval : corresponden a los cursos OMI (Organización Marítima Internacional)"]

{"sheet":"II-7.3.1 ","index":94,"n_rows":187,"n_cols":11,"rows_kept":187,"cut":false,"hidden":false,"merged":[[188,0,188,5],[0,3,1,6],[4,0,4,10],[5,0,8,0],[5,1,5,10],[6,1,8,1],[6,2,6,4],[6,5,6,7],[6,8,6,10],[7,2,8,2],[7,3,7,4],[7,5,8,5],[7,6,7,7],[7,8,8,8],[7,9,7,10],[186,0,186,10]]}
["UNIVERSIDADES E INSTITUTOS UNIVERSITARIOS",null,null,"PERSONAL ACADÉMICO"]
[]
["Cuadro Nº II-7.3.1"]
[]
["PERSONAL DOCENTE Y NO DOCENTE DE INSTITUCIONES UNIVERSITARIAS PÚBLICAS Y PRIVADAS EXPRESADAS EN POSICIONES FUNCIONALES POR CARGA HORARIA SEMANAL SEGÚN INSTITUCIÓN, ACTIVIDAD Y SEXO (Todo el país, 2017)"]
["INSTITUCIÓN / ACTIVIDAD","Carga horaria semanal"]
[null,"TOTAL","19 y -",null,null,"20 a 39",null,null,"40 y +"]
[null,null,"Total","Sexo",null,"Total","Sexo",null,"Total","Sexo"]
[null,null,null,"V","M",null,"V","M",null,"V","M"]
["TOTAL DOCENTE Y NO DOCENTE",{"$f":"+C10+F10+I10","v":26272},{"$f":"+C11+C12","v":9757},{"$f":"+D11+D12","v":3355},{"$f":"+E11+E12","v":2643},9163,667,560,7352,514,578]
["Total Personal Docente",{"$f":"+C11+F11+I11","v":18348},{"$f":"C15+C23+C27","v":9280},{"$f":"D15+D23+D27","v":3180},{"$f":"E15+E23+E27","v":2341},{"$f":"F15+F23+F27","v":6447},511,332,{"$f":"I15+I23+I27","v":2621},186,144]
["Total Personal NO Docente",{"$f":"+C12+F12+I12","v":7924},{"$f":"C16+C24+C28","v":477},{"$f":"D16+D24+D28","v":175},302,{"$f":"F16+F24+F28","v":2716},{"$f":"G16+G24+G28","v":156},{"$f":"H16+H24+H28","v":228},{"$f":"I16+I24+I28","v":4731},328,434]
[]
["TOTAL INSTITUCIONES UNIVERSITARIAS PÚBLICAS DOCENTE Y NO DOCENTE",{"$f":"+C14+F14+I14","v":18207},{"$f":"+C15+C16","v":3786},{"$f":"SUM(D15:D16)","v":14},{"$f":"SUM(E15:E16)","v":13},{"$f":"+F15+F16","v":8039},{"$f":"SUM(G15:G16)","v":61},{"$f":"SUM(H15:H16)","v":42},{"$f":"+I15+I16","v":6382},{"$f":"SUM(J15:J16)","v":55},{"$f":"SUM(K15:K16)","v":67}]
["Personal Docente de Universidades e Institutos Públicos",{"$f":"+C15+F15+I15","v":11819},{"$f":"C19+C31+C155","v":3784},{"$f":"D19+SUM(D31:D35)+SUM(D155:D159)","v":12},{"$f":"E19+SUM(E31:E35)+SUM(E155:E159)","v":13},{"$f":"F19+F31+F155","v":5693},{"$f":"G19+SUM(G31:G35)+SUM(G155:G159)","v":53},{"$f":"H19+SUM(H31:H35)+SUM(H155:H159)","v":36},{"$f":"I19+I31+I155","v":2342},{"$f":"J19+SUM(J31:J35)+SUM(J155:J159)","v":32},{"$f":"K19+SUM(K31:K35)+SUM(K155:K159)","v":19}]
["Personal NO Docente de Universidades e Institutos Públicos",{"$f":"+C16+F16+I16","v":6388},{"$f":"C20+C36+C160","v":2},{"$f":"D20+D36+D160","v":2},{"$f":"E20+E36+E160","v":0},2346,8,6,4040,23,48]
[]
["TOTAL UDELAR DOCENTE Y NO DOCENTE*",{"$f":"+C18+F18+I18","v":17955},{"$f":"+C19+C20","v":3759},"s/d","s/d",{"$f":"+F19+F20","v":7936},"s/d","s/d",{"$f":"+I19+I20","v":6260},"s/d","s/d"]
["Personal Docente UDELAR",{"$f":"+C19+F19+I19","v":11654},3759,"s/d","s/d",5604,"s/d","s/d",2291,"s/d","s/d"]
["Personal NO Docente UDELAR",{"$f":"+C20+F20+I20","v":6301},0,"s/d","s/d",2332,"s/d","s/d",3969,"s/d","s/d"]
[]
["TOTAL PRIVADOS DOCENTE Y NO DOCENTE",{"$f":"+C22+F22+I22","v":7768},{"$f":"+D22+E22","v":5734},{"$f":"+D23+D24","v":3135},{"$f":"+E23+E24","v":2599},{"$f":"+G22+H22","v":1098},{"$f":"+G23+G24","v":605},{"$f":"+H23+H24","v":493},{"$f":"+J22+K22","v":936},{"$f":"+J23+J24","v":439},{"$f":"+K23+K24","v":497}]
["Personal Docente de Universidades e Institutos Privados",{"$f":"+C23+F23+I23","v":6292},{"$f":"+D23+E23","v":5259},{"$f":"SUM(D39:D43,D47:D51,D55:D59,D63:D67,D71:D74,D78:D81,D85:D89,D93:D96,D100:D104,D108:D111,D115:D119,D123:D127,D163:D167,D171:D175,D179:D183)","v":2962},{"$f":"SUM(E39:E43,E47:E51,E55:E59,E63:E67,E71:E74,E78:E81,E85:E89,E93:E96,E100:E104,E108:E111,E115:E119,E123:E127,E163:E167,E171:E175,E179:E183)","v":2297},{"$f":"+G23+H23","v":754},{"$f":"SUM(G39:G43,G47:G51,G55:G59,G63:G67,G71:G74,G78:G81,G85:G89,G93:G96,G100:G104,G108:G111,G115:G119,G123:G127,G163:G167,G171:G175,G179:G183)","v":458},{"$f":"SUM(H39:H43,H47:H51,H55:H59,H63:H67,H71:H74,H78:H81,H85:H89,H93:H96,H100:H104,H108:H111,H115:H119,H123:H127,H163:H167,H171:H175,H179:H183)","v":296},{"$f":"+J23+K23","v":279},{"$f":"SUM(J39:J43,J47:J51,J55:J59,J63:J67,J71:J74,J78:J81,J85:J89,J93:J96,J100:J104,J108:J111,J115:J119,J123:J127,J163:J167,J171:J175,J179:J183)","v":154},{"$f":"SUM(K39:K43,K47:K51,K55:K59,K63:K67,K71:K74,K78:K81,K85:K89,K93:K96,K100:K104,K108:K111,K115:K119,K123:K127,K163:K167,K171:K175,K179:K183)","v":125}]
["Personal NO Docente de Universidades e Institutos Privados",{"$f":"+C24+F24+I24","v":1476},{"$f":"+D24+E24","v":475},{"$f":"D44+D52+D60+D68+D75+D83+D90+D97+D105+D113+D120+D128+D168+D176+D184","v":173},{"$f":"E44+E52+E60+E68+E75+E83+E90+E97+E105+E113+E120+E128+E168+E176+E184","v":302},{"$f":"+G24+H24","v":344},{"$f":"G44+G52+G60+G68+G75+G83+G90+G97+G105+G113+G120+G128+G168+G176+G184","v":147},{"$f":"H44+H52+H60+H68+H75+H83+H90+H97+H105+H113+H120+H128+H168+H176+H184","v":197},{"$f":"+J24+K24","v":657},{"$f":"J44+J52+J60+J68+J75+J83+J90+J97+J105+J113+J120+J128+J168+J176+J184","v":285},{"$f":"K44+K52+K60+K68+K75+K83+K90+K97+K105+K113+K120+K128+K168+K176+K184","v":372}]
[]
["TOTAL SEGURIDAD Y DEFENSA DOCENTE Y NO DOCENTE",{"$f":"+C26+F26+I26","v":297},{"$f":"+D26+E26","v":237},{"$f":"+D27+D28","v":206},{"$f":"+E27+E28","v":31},{"$f":"+G26+H26","v":26},{"$f":"+G27+G28","v":1},{"$f":"+H27+H28","v":25},{"$f":"+J26+K26","v":34},{"$f":"+J27+J28","v":20},{"$f":"+K27+K28","v":14}]
["Personal Docente Área Seguridad y Defensa",{"$f":"+C27+F27+I27","v":237},{"$f":"+D27+E27","v":237},{"$f":"SUM(D131:D135,D139:D143,D147:D151)","v":206},{"$f":"SUM(E131:E135,E139:E143,E147:E151)","v":31},{"$f":"+G27+H27","v":0},{"$f":"SUM(G131:G135,G139:G143,G147:G151)","v":0},{"$f":"SUM(H131:H135,H139:H143,H147:H151)","v":0},{"$f":"+J27+K27","v":0},{"$f":"SUM(J131:J135,J139:J143,J147:J151)","v":0},{"$f":"SUM(K131:K135,K139:K143,K147:K151)","v":0}]
["Personal NO Docente Área Seguridad y Defensa",{"$f":"+C28+F28+I28","v":60},{"$f":"+D28+E28","v":0},{"$f":"D136+D144+D152","v":0},{"$f":"E136+E144+E152","v":0},{"$f":"+G28+H28","v":26},{"$f":"G136+G144+G152","v":1},{"$f":"H136+H144+H152","v":25},{"$f":"+J28+K28","v":34},{"$f":"J136+J144+J152","v":20},{"$f":"K136+K144+K152","v":14}]
[]
["UNIVERSIDAD TECNOLÓGICA (UTEC)",{"$f":"C30+F30+I30","v":227},{"$f":"D30+E30","v":26},{"$f":"SUM(D31:D36)","v":13},{"$f":"SUM(E31:E36)","v":13},{"$f":"G30+H30","v":100},{"$f":"SUM(G31:G36)","v":58},{"$f":"SUM(H31:H36)","v":42},{"$f":"J30+K30","v":101},{"$f":"SUM(J31:J36)","v":47},{"$f":"SUM(K31:K36)","v":54}]
["Personal Docente",{"$f":"C31+F31+I31","v":158},{"$f":"D31+E31","v":24},11,13,{"$f":"G31+H31","v":87},51,36,{"$f":"J31+K31","v":47},29,18]
["Personal de Investigación y Extensión",0,0,0,0,0,0,0,0,0,0]
["Docente-Investigador",0,0,0,0,0,0,0,0,0,0]
["Personal de Gestión Universitaria",0,0,0,0,0,0,0,0,0,0]
["No desagregable por función",0,0,0,0,0,0,0,0,0,0]
["Personal no docente",69,2,2,0,13,7,6,54,18,36]
[]
["UCUDAL",2525,{"$f":"+D38+E38","v":1788},{"$f":"SUM(D39:D44)","v":827},{"$f":"SUM(E39:E44)","v":961},{"$f":"+G38+H38","v":315},{"$f":"SUM(G39:G44)","v":152},{"$f":"SUM(H39:H44)","v":163},{"$f":"+J38+K38","v":422},{"$f":"SUM(J39:J44)","v":188},{"$f":"SUM(K39:K44)","v":234}]
["Personal Docente",1247,1246,648,598,1,0,1,0,0,0]
["Personal de Investigación y Extensión",0,0,0,0,0,0,0,0,0,0]
["Docente-Investigador",231,93,23,70,113,46,67,25,17,8]
["Personal de Gestión Universitaria",204,112,41,71,40,21,19,52,26,26]
["No desagregable por función",26,0,0,0,26,26,0,0,0,0]
["Personal no docente",817,337,115,222,135,59,76,345,145,200]
[]
["UNIVERSIDAD ORT URUGUAY ",{"$f":"C46+F46+I46","v":2283},{"$f":"+D46+E46","v":1838},{"$f":"SUM(D47:D52)","v":1139},{"$f":"SUM(E47:E52)","v":699},{"$f":"+G46+H46","v":215},{"$f":"SUM(G47:G52)","v":125},{"$f":"SUM(H47:H52)","v":90},{"$f":"+J46+K46","v":230},{"$f":"SUM(J47:J52)","v":112},{"$f":"SUM(K47:K52)","v":118}]
["Personal Docente",{"$f":"C47+F47+I47","v":1489},1482,923,559,7,1,6,0,0,0]
["Personal de Investigación y Extensión",46,36,24,12,7,7,0,3,1,2]
["Docente-Investigador",0,0,0,0,0,0,0,0,0,0]
["Personal de Gestión Universitaria",438,233,160,73,87,41,46,118,59,59]
["No desagregable por función",59,0,0,0,59,59,0,0,0,0]
["Personal no docente",251,87,32,55,55,17,38,109,52,57]
[]
["UNIVERSIDAD DE MONTEVIDEO",{"$f":"C54+F54+I54","v":934},{"$f":"+D54+E54","v":495},{"$f":"SUM(D55:D60)","v":305},{"$f":"SUM(E55:E60)","v":190},{"$f":"+G54+H54","v":294},{"$f":"SUM(G55:G60)","v":172},{"$f":"SUM(H55:H60)","v":122},{"$f":"+J54+K54","v":145},{"$f":"SUM(J55:J60)","v":71},{"$f":"SUM(K55:K60)","v":74}]
["Personal Docente",{"$f":"C55+F55+I55","v":0},0,0,0,0,0,0,0,0,0]
["Personal de Investigación y Extensión",0,0,0,0,0,0,0,0,0,0]
["Docente-Investigador",{"$f":"C57+F57+I57","v":745},480,295,185,232,153,79,33,25,8]
["Personal de Gestión Universitaria",0,0,0,0,0,0,0,0,0,0]
["No desagregable por función",0,0,0,0,0,0,0,0,0,0]
["Personal no docente",{"$f":"C60+F60+I60","v":189},15,10,5,62,19,43,112,46,66]
[]
["UNIVERSIDAD DE LA EMPRESA",{"$f":"C62+F62+I62","v":1149},{"$f":"+D62+E62","v":829},{"$f":"SUM(D63:D68)","v":486},{"$f":"SUM(E63:E68)","v":343},{"$f":"+G62+H62","v":239},{"$f":"SUM(G63:G68)","v":136},{"$f":"SUM(H63:H68)","v":103},{"$f":"+J62+K62","v":81},{"$f":"SUM(J63:J68)","v":45},{"$f":"SUM(K63:K68)","v":36}]
["Personal Docente",{"$f":"C63+F63+I63","v":920},789,466,323,124,68,56,7,6,1]
["Personal de Investigación y Extensión",19,8,5,3,11,7,4,0,0,0]
["Docente-Investigador",18,6,2,4,12,8,4,0,0,0]
["Personal de Gestión Universitaria",23,0,0,0,7,5,2,16,7,9]
["No desagregable por función",9,0,0,0,9,9,0,0,0,0]
["Personal no docente",160,26,13,13,76,39,37,58,32,26]
[]
["INST UNIV CLAEH ",{"$f":"C70+F70+I70","v":0},{"$f":"+D70+E70","v":0},{"$f":"SUM(D71:D75)","v":0},{"$f":"SUM(E71:E75)","v":0},{"$f":"+G70+H70","v":0},{"$f":"SUM(G71:G75)","v":0},{"$f":"SUM(H71:H75)","v":0},{"$f":"+J70+K70","v":0},{"$f":"SUM(J71:J75)","v":0},{"$f":"SUM(K71:K75)","v":0}]
["Personal Docente",0,0,"s/d","s/d",0,"s/d","s/d",0,"s/d","s/d"]
["Personal de Investigación y Extensión",0,0,"s/d","s/d",0,"s/d","s/d",0,"s/d","s/d"]
["Docente-Investigador",0,0,"s/d","s/d",0,"s/d","s/d",0,"s/d","s/d"]
["Personal de Gestión Universitaria",0,0,"s/d","s/d",0,"s/d","s/d",0,"s/d","s/d"]
["Personal no docente",0,0,"s/d","s/d",0,"s/d","s/d",0,"s/d","s/d"]
[]
["INST METODISTA UNIV CRANDON ",{"$f":"C77+F77+I77","v":42},{"$f":"+D77+E77","v":42},{"$f":"SUM(D78:D82)","v":21},{"$f":"SUM(E78:E82)","v":21},{"$f":"+G77+H77","v":0},{"$f":"SUM(G78:G82)","v":0},{"$f":"SUM(H78:H82)","v":0},{"$f":"+J77+K77","v":0},{"$f":"SUM(J78:J82)","v":0},{"$f":"SUM(K78:K82)","v":0}]
["Personal Docente",42,42,21,21,0,0,0,0,0,0]
["Personal de Investigación y Extensión",0,0,0,0,0,0,0,0,0,0]
["Docente-Investigador",0,0,0,0,0,0,0,0,0,0]
["Personal de Gestión Universitaria",0,0,0,0,0,0,0,0,0,0]
["No desagregable por función",0,0,0,0,0,0,0,0,0,0]
["Personal no docente",0,0,0,0,0,0,0,0,0,0]
["INST UNIV DE POSTGRADO EN PSICOANÁLISIS (APU)",38,38,{"$f":"SUM(D85:D90)","v":8},{"$f":"SUM(E85:E90)","v":30},0,{"$f":"SUM(G85:G90)","v":0},{"$f":"SUM(H85:H90)","v":0},0,{"$f":"SUM(J85:J90)","v":0},{"$f":"SUM(K85:K90)","v":0}]
["Personal Docente",33,33,6,27,0,0,0,0,0,0]
["Personal de Investigación y Extensión",0,0,0,0,0,0,0,0,0,0]
["Docente-Investigador",0,0,0,0,0,0,0,0,0,0]
["Personal de Gestión Universitaria",0,0,0,0,0,0,0,0,0,0]
["No desagregable por función",0,0,0,0,0,0,0,0,0,0]
["Personal no docente",5,5,2,3,0,0,0,0,0,0]
[]
["INST UNIV ASOCIACIÓN CRISTIANA DE JÓVENES ",{"$f":"C92+F92+I92","v":380},{"$f":"+D92+E92","v":336},{"$f":"SUM(D93:D97)","v":188},{"$f":"SUM(E93:E97)","v":148},{"$f":"+G92+H92","v":23},{"$f":"SUM(G93:G97)","v":17},{"$f":"SUM(H93:H97)","v":6},{"$f":"+J92+K92","v":21},{"$f":"SUM(J93:J97)","v":11},{"$f":"SUM(K93:K97)","v":10}]
["Personal Docente",281,281,160,121,0,0,0,0,0,0]
["Personal de Investigación y Extensión",40,40,22,18,0,0,0,0,0,0]
["Docente-Investigador",0,0,0,0,0,0,0,0,0,0]
["Personal de Gestión Universitaria",49,15,6,9,13,7,6,21,11,10]
["Personal no docente",10,0,0,0,10,10,0,0,0,0]
[]
["INST UNIV MONSEÑOR MARIANO SOLER ",{"$f":"C99+F99+I99","v":41},{"$f":"+D99+E99","v":41},{"$f":"SUM(D100:D105)","v":38},{"$f":"SUM(E100:E105)","v":3},{"$f":"+G99+H99","v":0},{"$f":"SUM(G100:G105)","v":0},{"$f":"SUM(H100:H105)","v":0},{"$f":"+J99+K99","v":0},{"$f":"SUM(J100:J105)","v":0},{"$f":"SUM(K100:K105)","v":0}]
["Personal Docente",{"$f":"C100+F100+I100","v":41},41,38,3,0,0,0,0,0,0]
["Personal de Investigación y Extensión",0,0,0,0,0,0,0,0,0,0]
["Docente-Investigador",0,0,0,0,0,0,0,0,0,0]
["Personal de Gestión Universitaria",0,0,0,0,0,0,0,0,0,0]
["No desagregable por función",0,0,0,0,0,0,0,0,0,0]
["Personal no docente",0,0,0,0,0,0,0,0,0,0]
[]
["INST UNIV FRANCISCO DE ASÍS",{"$f":"C107+F107+I107","v":104},{"$f":"+D107+E107","v":94},{"$f":"SUM(D108:D113)","v":47},{"$f":"SUM(E108:E113)","v":47},{"$f":"+G107+H107","v":6},{"$f":"SUM(G108:G113)","v":3},{"$f":"SUM(H108:H113)","v":3},{"$f":"+J107+K107","v":4},{"$f":"SUM(J108:J113)","v":1},{"$f":"SUM(K108:K113)","v":3}]
["Personal Docente",85,85,43,42,0,0,0,0,0,0]
["Personal de Investigación y Extensión",0,0,0,0,0,0,0,0,0,0]
["Docente-Investigador",0,0,0,0,0,0,0,0,0,0]
["Personal de Gestión Universitaria",5,5,3,2,0,0,0,0,0,0]
["No desagregable por función",0,0,0,0,0,0,0,{"$f":"+J112+K112","v":0},0,0]
["Personal no docente",14,4,1,3,6,3,3,{"$f":"+J113+K113","v":4},1,3]
["INST UNIV CEDIIAP",{"$f":"C114+F114+I114","v":78},67,{"$f":"SUM(D115:D120)","v":13},{"$f":"SUM(E115:E120)","v":54},1,{"$f":"SUM(G115:G120)","v":0},{"$f":"SUM(H115:H120)","v":1},{"$f":"+J114+K114","v":10},{"$f":"SUM(J115:J120)","v":2},{"$f":"SUM(K115:K120)","v":8}]
["Personal Docente",{"$f":"C115+F115+I115","v":68},67,13,54,1,0,1,0,0,0]
["Personal de Investigación y Extensión",{"$f":"C116+F116+I116","v":0},0,0,0,0,0,0,0,0,0]
["Docente-Investigador",0,0,0,0,0,0,0,0,0,0]
["Personal de Gestión Universitaria",0,0,0,0,0,0,0,0,0,0]
["No desagregable por función",0,0,0,0,0,0,0,0,0,0]
["Personal no docente",10,0,0,0,0,0,0,10,2,8]
[]
["Fundación Politécnico de Punta del Este",43,37,{"$f":"SUM(D123:D128)","v":21},{"$f":"SUM(E123:E128)","v":16},0,{"$f":"SUM(G123:G128)","v":0},{"$f":"SUM(H123:H128)","v":0},6,{"$f":"SUM(J123:J128)","v":3},{"$f":"SUM(K123:K128)","v":3}]
["Personal Docente",39,37,21,16,0,0,0,2,2,0]
["Personal de Investigación y Extensión",0,0,0,0,0,0,0,0,0,0]
["Docente-Investigador",0,0,0,0,0,0,0,0,0,0]
["Personal de Gestión Universitaria",0,0,0,0,0,0,0,0,0,0]
["No desagregable por función",0,0,0,0,0,0,0,0,0,0]
["Personal no docente",4,0,0,0,0,0,0,4,1,3]
[]
["Escuela Nacional de Policía",56,56,{"$f":"SUM(D131:D135)","v":44},{"$f":"SUM(E131:E135)","v":12},0,{"$f":"SUM(G131:G135)","v":0},{"$f":"SUM(H131:H135)","v":0},0,{"$f":"SUM(J131:J135)","v":0},{"$f":"SUM(K131:K135)","v":0}]
["Personal Docente",56,56,44,12,0,0,0,0,0,0]
["Personal de Investigación y Extensión",0,0,0,0,0,0,0,0,0,0]
["Docente-Investigador",0,0,0,0,0,0,0,0,0,0]
["Personal de Gestión Universitaria",0,0,0,0,0,0,0,0,0,0]
["No desagregable por función",0,0,0,0,0,0,0,0,0,0]
["Personal no docente",0,0,0,0,0,0,0,0,0,0]
[]
["Centro de Altos Estudios Nacionales",{"$f":"C138+F138+I138","v":99},{"$f":"+D138+E138","v":73},{"$f":"SUM(D139:D144)","v":61},{"$f":"SUM(E139:E144)","v":12},{"$f":"+G138+H138","v":26},{"$f":"SUM(G139:G144)","v":1},{"$f":"SUM(H139:H144)","v":25},{"$f":"+J138+K138","v":0},{"$f":"SUM(J139:J144)","v":0},{"$f":"SUM(K139:K144)","v":0}]
["Personal Docente",{"$f":"C139+F139+I139","v":0},0,0,0,0,0,0,0,0,0]
["Personal de Investigación y Extensión",64,64,54,10,0,0,0,0,0,0]
["Docente-Investigador",9,9,7,2,0,0,0,0,0,0]
["Personal de Gestión Universitaria",0,0,0,0,0,0,0,0,0,0]
["No desagregable por función",0,0,0,0,0,0,0,0,0,0]
["Personal no docente",26,0,0,0,26,1,25,0,0,0]
[]
["Escuela de Guerra Naval (ESGUE)",{"$f":"C146+F146+I146","v":142},{"$f":"D146+E146","v":108},{"$f":"SUM(D147:D152)","v":101},{"$f":"SUM(E147:E152)","v":7},{"$f":"G146+H146","v":0},{"$f":"SUM(G147:G152)","v":0},{"$f":"SUM(H147:H152)","v":0},{"$f":"J146+K146","v":34},{"$f":"SUM(J147:J152)","v":20},{"$f":"SUM(K147:K152)","v":14}]
["Personal Docente",{"$f":"C147+F147+I147","v":108},{"$f":"D147+E147","v":108},101,7,0,0,0,0,0,0]
["Personal de Investigación y Extensión",0,{"$f":"D148+E148","v":0},0,0,0,0,0,0,0,0]
["Docente-Investigador",0,0,0,0,0,0,0,0,0,0]
["Personal de Gestión Universitaria",0,0,0,0,0,0,0,0,0,0]
["No desagregable por función",0,0,0,0,0,0,0,0,0,0]
["Personal no docente",34,0,0,0,0,0,0,34,20,14]
[]
["IPES",25,1,{"$f":"SUM(D155:D160)","v":1},{"$f":"SUM(E155:E160)","v":0},3,{"$f":"SUM(G155:G160)","v":3},{"$f":"SUM(H155:H160)","v":0},21,{"$f":"SUM(J155:J160)","v":8},{"$f":"SUM(K155:K160)","v":13}]
["Personal Docente",7,1,1,0,2,2,0,4,3,1]
["Personal de Investigación y Extensión",0,0,0,0,0,0,0,0,0,0]
["Docente-Investigador",0,0,0,0,0,0,0,0,0,0]
["Personal de Gestión Universitaria",0,0,0,0,0,0,0,0,0,0]
["No desagregable por función",0,0,0,0,0,0,0,0,0,0]
["Personal no docente",18,0,0,0,1,1,0,17,5,12]
[]
["Instituto Universitario Elbio Fernández",{"$f":"C162+F162+I162","v":74},{"$f":"D162+E162","v":56},{"$f":"SUM(D163:D168)","v":3},{"$f":"SUM(E163:E168)","v":53},3,{"$f":"SUM(G163:G168)","v":0},{"$f":"SUM(H163:H168)","v":3},15,{"$f":"SUM(J163:J168)","v":6},{"$f":"SUM(K163:K168)","v":9}]
["Personal Docente",46,46,2,44,0,0,0,0,0,0]
["Personal de Investigación y Extensión",10,10,1,9,0,0,0,0,0,0]
["Docente-Investigador",0,0,0,0,0,0,0,0,0,0]
["Personal de Gestión Universitaria",3,0,0,0,3,0,3,0,0,0]
["No desagregable por función",0,0,0,0,0,0,0,0,0,0]
["Personal no docente",15,0,0,0,0,0,0,15,6,9]
[]
["Escuela de Formación Profesional en Comercio Exterior y Aduana",{"$f":"C170+F170+I170","v":58},{"$f":"D170+E170","v":58},{"$f":"SUM(D171:D176)","v":34},{"$f":"SUM(E171:E176)","v":24},0,{"$f":"SUM(G171:G176)","v":0},{"$f":"SUM(H171:H176)","v":0},0,{"$f":"SUM(J171:J176)","v":0},{"$f":"SUM(K171:K176)","v":0}]
["Personal Docente",58,58,34,24,0,0,0,0,0,0]
["Personal de Investigación y Extensión",0,0,0,0,0,0,0,0,0,0]
["Docente-Investigador",0,0,0,0,0,0,0,0,0,0]
["Personal de Gestión Universitaria",0,0,0,0,0,0,0,0,0,0]
["No desagregable por función",0,0,0,0,0,0,0,0,0,0]
["Personal no docente",0,0,0,0,0,0,0,0,0,0]
[]
["IUCEDDU",{"$f":"C178+F178+I178","v":19},15,{"$f":"SUM(D179:D184)","v":5},{"$f":"SUM(E179:E184)","v":10},2,{"$f":"SUM(G179:G184)","v":0},{"$f":"SUM(H179:H184)","v":2},2,{"$f":"SUM(J179:J184)","v":0},{"$f":"SUM(K179:K184)","v":2}]
["Personal Docente",{"$f":"C179+F179+I179","v":17},13,5,8,2,0,2,2,0,2]
["Personal de Investigación y Extensión",0,0,0,0,0,0,0,0,0,0]
["Docente-Investigador",0,0,0,0,0,0,0,0,0,0]
["Personal de Gestión Universitaria",1,1,0,1,0,0,0,0,0,0]
["No desagregable por función",0,0,0,0,0,0,0,0,0,0]
["Personal no docente",1,1,0,1,0,0,0,0,0,0]
[]
["Fuente: Oficinas Productoras de cada una de las Instituciones. "]
["Nota:* SIAP - Padrón Setiembre 2017. No se dispone de la información discriminada por sexo. "]

{"sheet":"EDUCACIÓN DE JÓVENES Y ADUL ","index":95,"n_rows":87,"n_cols":2,"rows_kept":87,"cut":false,"hidden":false,"merged":[]}
[]
[]
[]
[]
[]
[]
[]
[]
["Cuadro II-8.1.1","ESTUDIANTES MATRICULADOS EN EDUCACIÓN PRIMARIA POR SEXO SEGÚN GRANDES ÁREAS Y DEPARTAMENTO.  (Todo el país)."]
[""]
["Cuadro II-8.1.2","ESTUDIANTES MATRICULADOS EN TALLERES SEGÚN SEXO, GRANDES ÁREAS Y DEPARTAMENTOS.  (Todo el país)."]
[""]
["Cuadro II-8.1.3","CANTIDAD DE PRUEBAS DE ACREDITACIÓN SEGÚN SEXO, GRANDES ÁREAS Y DEPARTAMENTOS.  (Todo el país)."]
[""]
["Cuadro II-8.1.4","ESTUDIANTES MATRICULADOS EN CURSOS DE EDUCACIÓN TÉCNICA PARA JÓVENES Y ADULTOS POR GRANDES ÁREAS Y SEXO SEGÚN TIPO DE CURSO.  (Todo el país, 2017). "]
[""]
["Cuadro II-8.1.5","ESTUDIANTES MATRICULADOS EN CURSOS DE EDUCACIÓN TÉCNICA PARA JÓVENES Y ADULTOS POR EDAD SEGÚN TIPO DE CURSO.  (Todo el país, 2017)."]
[""]
["Cuadro II-8.1.6","ESTUDIANTES MATRICULADOS EN EDUCACIÓN  TÉCNICA EN NIVEL DE FORMACIÓN PROFESIONAL.  (Todo el país, 2017)."]
[""]
["Cuadro II-8.1.7","ESTUDIANTES MATRICULADOS EN EDUCACIÓN TÉCNICA POR TIPO DE CURSO SEGÚN ÁREAS Y SECTORES DE ESTUDIO.  (Todo el país, 2017)."]
[""]
["Cuadro II-8.1.8","ESTUDIANTES INGRESADOS, MATRICULADOS Y EGRESADOS EN CECAP POR SEXO, SEGÚN DEPARTAMENTO Y EDAD.  (Todo el país, 2017)."]
[""]
["Cuadro II-8.1.9","ESTUDIANTES CON EGRESO ANTICIPADO Y DESVINCULADOS DE CECAP POR SEXO, SEGÚN DEPARTAMENTO Y EDAD.  (Todo el país, 2017)."]
[""]
["Cuadro II-8.1.10","ESTUDIANTES INGRESADOS, MATRICULADOS Y EGRESADOS EN OFERTAS EDUCATIVAS NO TERCIARIAS DE UNIVERSIDADES PRIVADAS POR SEXO.  (Todo el país, 2017)."]
[""]
[""]
[]
["Cuadro II-8.2.1","PERSONAL DOCENTE  DE CECAP, TITULADO Y NO TITULADO, POR SEXO, REGIÓN Y DEPARTAMENTO SEGÚN CARGA HORARIA SEMANAL.  (Todo el país, 2017). "]
[""]
["Cuadro II-8.2.2","DOCENTES POR SEXO SEGÚN GRANDES ÁREAS Y DEPARTAMENTO.  (Todo el país)."]
[""]
[""]
["Cuadro II-8.3.1","CANTIDAD DE CURSOS, DE HORAS Y DE ESTUDIANTES MATRICULADOS SEGÚN TIPO DE CURSO Y ÁREA DE FORMACIÓN COCAP.  (Todo el país, 2017)."]
[""]
[""]
[]
["Cuadro II-8.4.1 ","MATRÍCULA Y PERSONAL DOCENTE DEL RELEVAMIENTO DE INSTITUCIONES DE OFERTA DE FORMACIÓN EN EDUCACIÓN NO FORMAL POR SEXO SEGÚN TIPO DE INSTITUCIÓN E INSTITUCIONES. (Todo el país, 2017)"]
[""]
["Cuadro II-8.4.2","ESTUDIANTES INGRESADOS, MATRÍCULA  Y EGRESADOS DEL RELEVAMIENTO DE INSTITUCIONES DE OFERTA DE FORMACIÓN EN EDUCACIÓN NO FORMAL SEGÚN REGIÓN Y ÁREAS DE CONOCIMIENTO. (Todo el país, 2017)"]
[]
[""]
[" "]
[]
[]
[]
[]
[]
[]
[]
[]
[]
[]
[]
[{"$f":"MID(B22,1,20)","v":""}]
[]
[]
[]
[]
[]
[{"$f":"MID(B28,1,20)","v":""}]
[{"$f":"MID(B29,1,20)","v":""}]
[]
[{"$f":"MID(B32,1,20)","v":""}]
[]
[]
[{"$f":"MID(B35,1,20)","v":""}]
[]
[{"$f":"MID(B37,1,20)","v":""}]
[{"$f":"MID(B38,1,20)","v":""}]
[]
[{"$f":"MID(B41,1,20)","v":""}]
[]
[""]
[""]
[""]
[""]
[""]
[""]
[""]
[""]
[""]
[""]
[""]
[""]

{"sheet":" II-8.1.1","index":96,"n_rows":35,"n_cols":10,"rows_kept":35,"cut":false,"hidden":false,"merged":[[7,7,8,7],[7,8,7,9],[0,2,0,4],[2,0,2,1],[3,2,4,3],[6,0,6,6],[7,0,8,0],[7,1,8,1],[7,2,7,3],[7,4,8,4],[7,5,7,6]]}
["ANEP",null,"MATRICULADOS"]
["CODICEN – PROGRAMA NACIONAL DE JÓVENES Y ADULTOS"]
[]
[]
["Cuadro Nº  II-8.1.1"]
[]
["ESTUDIANTES MATRICULADOS EN EDUCACIÓN PRIMARIA POR SEXO SEGÚN GRANDES ÁREAS Y DEPARTAMENTO            (Todo el país)*"]
["GRANDES ÁREAS Y DEPARTAMENTOS","TOTAL","PRIMER  TRAMO: NIVEL I",null,"TOTAL","SEGUNDO TRAMO: NIVEL II",null,"TOTAL","CICLO PRIMARIO TOTAL"]
[null,null,"V","M",null,"V","M",null,"V","M"]
["TOTAL",{"$f":"+B11+B12","v":1097},{"$f":"+C11+C12","v":543},554,2039,1075,964,3136,1618,1518]
["MONTEVIDEO",{"$f":"C11+D11","v":538},276,262,{"$f":"F11+G11","v":1019},564,455,{"$f":"I11+J11","v":1557},840,717]
["RESTO DEL PAÍS",{"$f":"SUM(B13:B30)","v":559},{"$f":"SUM(C13:C30)","v":267},292,1020,511,509,1579,778,801]
["Artigas",{"$f":"C13+D13","v":14},6,8,{"$f":"F13+G13","v":36},10,26,{"$f":"I13+J13","v":50},16,34]
["Canelones",136,78,58,228,99,129,364,177,187]
["Cerro Largo",12,7,5,57,24,33,69,31,38]
["Colonia",47,16,31,25,12,13,72,28,44]
["Durazno",10,7,3,29,9,20,39,16,23]
["Flores","-","-","-","-","-","-","-","-","-"]
["Florida",18,7,11,19,10,9,37,17,20]
["Lavalleja",2,1,1,35,24,11,37,25,12]
["Maldonado",60,26,34,60,53,7,120,79,41]
["Paysandú",41,19,22,133,48,85,174,67,107]
["Río Negro",17,8,9,50,19,31,67,27,40]
["Rivera",32,10,22,75,23,52,107,33,74]
["Rocha",14,3,11,8,1,7,22,4,18]
["Salto",33,9,24,15,5,10,48,14,34]
["San José",38,26,12,149,118,31,187,144,43]
["Soriano",38,28,10,47,22,25,85,50,35]
["Tacuarembó",47,16,31,33,18,15,80,34,46]
["Treinta y Tres",{"$f":"C30+D30","v":0},0,0,21,16,5,21,16,5]
[]
["Fuente: ANEP - CODICEN - Dirección Sectorial de Educación de Adultos."]
["Nota: *Los datos corresponden a 2013 pues son los últimos disponibles"]
["Observaciones: "]
["El departamento de Flores no cuenta con cargo de Maestro para el período 2013"]

{"sheet":" II-8.1.2","index":97,"n_rows":35,"n_cols":4,"rows_kept":35,"cut":false,"hidden":false,"merged":[[0,1,0,3],[1,0,1,1],[2,2,3,3],[5,0,6,0],[5,1,6,1],[5,2,5,3],[4,0,4,3]]}
["ANEP"," MATRICULADOS"]
["CODICEN – DIRECCIÓN SECTORIAL DE JÓVENES Y ADULTOS"]
[]
["Cuadro Nº  II-8.1.2"]
["ESTUDIANTES MATRICULADOS EN TALLERES POR SEXO SEGÚN GRANDES ÁREAS Y DEPARTAMENTO. (Todo el país) *"]
["GRANDES ÁREAS Y DEPARTAMENTOS","TOTAL","TALLERES"]
[null,null,"V","M"]
["TOTAL",{"$f":"+B9+B10","v":4065},{"$f":"C9+C10","v":1587},{"$f":"D9+D10","v":2478}]
["MONTEVIDEO",{"$f":"C9+D9","v":3248},1119,2129]
["RESTO DEL PAÍS",817,468,349]
["Artigas",0,"-","-"]
["Canelones",{"$f":"C12+D12","v":243},184,59]
["Cerro Largo",12,7,5]
["Colonia",33,9,24]
["Durazno",{"$f":"C15+D15","v":0},"-","-"]
["Flores",14,7,7]
["Florida",0,"-","-"]
["Lavalleja",67,22,45]
["Maldonado",18,18,0]
["Paysandú",13,9,4]
["Río Negro",12,11,1]
["Rivera",118,40,78]
["Rocha",0,"-","-"]
["Salto",{"$f":"C24+D24","v":148},84,64]
["San José",0,"-","-"]
["Soriano",37,22,15]
["Tacuarembó",102,55,47]
["Treinta y Tres",0,"-","-"]
["Fuente: ANEP - CODICEN - Dirección Sectorial de Educación de Adultos."]
["Nota:* Los datos corresponden a 2013 pues son los últimos disponibles"]
["Observaciones: "]
["Los departamentos de Artigas, Durazno, Florida Rocha, San José y Treinta y Tres no cuentan con docentes de Talleres en el período 2013"]
[]
[]
[" "]

{"sheet":"II-8.1.3","index":98,"n_rows":30,"n_cols":4,"rows_kept":30,"cut":false,"hidden":false,"merged":[[0,3,0,4],[29,0,29,6],[31,0,31,6],[2,0,2,4],[3,0,3,3],[4,0,6,0],[4,1,6,1],[4,2,4,3],[5,2,5,3],[1,0,1,2]]}
["ANEP",null,null,"PRUEBAS DE ACREDITACIÓN"]
["CODICEN – DIRECCIÓN SECTORIAL DE EDUCACIÓN DE ADULTOS"]
["Cuadro Nº II-8.1.3"]
["CANTIDAD DE PRUEBAS DE ACREDITACIÓN SEGÚN SEXO, GRANDES ÁREAS Y DEPARTAMENTOS (Todo el país)*"]
["GRANDES ÁREAS Y DEPARTAMENTOS","TOTAL","Prueba de Acreditación"]
[null,null,"SEXO"]
[null,null,"V","M"]
["TOTAL",{"$f":"+B9+B10","v":1151},{"$f":"C9+C10","v":591},{"$f":"D9+D10","v":560}]
["MONTEVIDEO",{"$f":"C9+D9","v":263},134,129]
["RESTO DEL PAÍS",{"$f":"C10+D10","v":888},457,431]
["Artigas",{"$f":"C11+D11","v":34},4,30]
["Canelones",200,101,99]
["Cerro Largo",45,14,31]
["Colonia",21,9,12]
["Durazno",23,13,10]
["Flores",12,4,8]
["Florida",5,0,5]
["Lavalleja",9,2,7]
["Maldonado",61,39,22]
["Paysandú",82,31,51]
["Río Negro",17,7,10]
["Rivera",62,35,27]
["Rocha",26,7,19]
["Salto",18,5,13]
["San José",177,154,23]
["Soriano",34,12,22]
["Tacuarembó",44,12,32]
["Treinta y Tres",18,8,10]
["Fuente: ANEP - CODICEN - Dirección Sectorial de Educación de Adultos"]
["Nota: *Los datos corresponden a 2013 pues son los últimos disponibles"]

{"sheet":"II-8.1.4","index":99,"n_rows":24,"n_cols":11,"rows_kept":24,"cut":false,"hidden":false,"merged":[[10,6,10,7],[10,9,10,10],[0,10,1,11],[7,0,11,0],[7,2,9,4],[7,5,8,10],[9,6,9,7],[9,9,9,10],[10,2,11,2],[10,3,10,4],[4,0,5,9]]}
["CONSEJO DE EDUCACIÓN TÉCNICO PROFESIONAL (U.T.U.)",null,null,null,null,null,null,null,null,null,"MATRICULADOS"]
[]
["Cuadro Nº II-8.1.4"]
[]
["ESTUDIANTES MATRICULADOS EN CURSOS DE EDUCACIÓN TÉCNICA PARA JÓVENES Y ADULTOS POR GRANDES ÁREAS Y SEXO SEGÚN TIPO DE CURSO (Todo el país, 2017)"]
[]
[]
["TIPO DE CURSO",null,"TOTAL",null,null,"GRANDES ÁREAS"]
[]
[null,"TOTAL ",null,null,null,null,"MONTEVIDEO ",null,null,"RESTO DEL PAÍS"]
[null,null,"Total","SEXO",null,null,"SEXO",null,null,"SEXO"]
[null,"Total ",null,"VARÓN","MUJER","Total ","V","M","Total","V","M"]
["TOTAL",null,{"$f":"SUM(C16:C23)","v":2942},{"$f":"SUM(D16:D23)","v":1368},1574,2586,1202,1384,356,166,190]
[]
["Nivel Formación profesional "]
["CAP. PROFUNDIZACIÓN PROFESIONAL",null,{"$f":"+D16+E16","v":122},{"$f":"G16+J16","v":68},{"$f":"H16+K16","v":54},{"$f":"+G16+H16","v":81},51,30,{"$f":"+J16+K16","v":41},17,24]
["CAPACITACIÓN PROFESIONAL",null,{"$f":"+D17+E17","v":31},{"$f":"G17+J17","v":31},{"$f":"H17+K17","v":0},{"$f":"+G17+H17","v":31},31,null,{"$f":"+J17+K17","v":0}]
["CAPACITACIÓN PROFESIONAL INICIAL",null,1333,655,678,1043,506,537,290,149,141]
["CURSO BÁSICO",null,194,54,140,194,54,140,0]
["CURSO BÁSICO ESPECIALIZACIÓN",null,216,50,166,191,50,141,25,null,25]
["FORM. PROFES. EN ARTES Y ARTESANÍAS",null,532,168,364,532,168,364,0]
["FORMACIÓN PROFESIONAL BÁSICA",null,431,276,155,431,276,155,0]
["FORMACIÓN PROFESIONAL ESPECIALIZADA",null,83,66,17,83,66,17,0]
["Fuente: CETP-UTU"]

{"sheet":"II-8.1.5.","index":100,"n_rows":17,"n_cols":13,"rows_kept":17,"cut":false,"hidden":false,"merged":[[0,11,1,12],[4,0,4,12],[5,0,6,0],[5,1,6,1],[5,2,5,11]]}
["CONSEJO DE EDUCACIÓN TÉCNICO PROFESIONAL (U.T.U.)",null,null,null,null,null,null,null,null,null,null,"ALUMNOS MATRICULADOS"]
[]
["Cuadro Nº II-8.1.5"]
[]
["ESTUDIANTES MATRICULADOS EN CURSOS DE EDUCACIÓN TÉCNICA PARA JÓVENES Y ADULTOS POR EDAD SEGÚN TIPO DE CURSO (Todo el país, 2017)"]
["TIPO DE CURSO","TOTAL"]
[null,null,"13 años","14 años","15 años","16 años","17 años","18años","19años","20 a 24 años","25 a 29 años","30 años y más","Edad desco"]
["TOTAL",{"$f":"SUM(B9:B16)","v":2942},0,0,0,0,0,0,0,500,338,1220,884]
["CAP. PROFUNDIZACIÓN PROFESIONAL",{"$f":"SUM(C9:M9)","v":122},0,0,0,0,0,0,0,22,12,65,23]
["CAPACITACIÓN PROFESIONAL",31,0,0,0,0,0,0,0,6,7,16,2]
["CAPACITACIÓN PROFESIONAL INICIAL",1333,0,0,0,0,0,0,0,185,130,524,494]
["CURSO BÁSICO",194,0,0,0,0,0,0,0,41,19,67,67]
["CURSO BÁSICO ESPECIALIZACIÓN",216,0,0,0,0,0,0,0,44,26,56,90]
["FORM. PROFES. EN ARTES Y ARTESANÍAS",532,0,0,0,0,0,0,0,98,66,317,51]
["FORMACIÓN PROFESIONAL BÁSICA",431,0,0,0,0,0,0,0,86,69,151,125]
["FORMACIÓN PROFESIONAL ESPECIALIZADA",83,0,0,0,0,0,0,0,18,9,24,32]
["Fuente: DE - CETP (UTU)"]

{"sheet":"II-8.1.6","index":101,"n_rows":29,"n_cols":5,"rows_kept":29,"cut":false,"hidden":false,"merged":[[4,0,5,0],[4,1,5,1],[3,0,3,2],[0,4,0,6]]}
["CONSEJO DE EDUCACIÓN TÉCNICO PROFESIONAL (U.T.U.)",null,null,null," MATRICULADOS"]
[]
["Cuadro Nº II-8.1.6"]
["ESTUDIANTES MATRICULADOS EN EDUCACIÓN TÉCNICA EN NIVEL DE FORMACIÓN PROFESIONAL (Todo el país, 2017)"]
["DEPARTAMENTO ","Total "]
[]
["TOTAL ",{"$f":"SUM(B8:B9)","v":2942}]
["MONTEVIDEO ",2586]
["RESTO DEL PAÍS",{"$f":"SUM(B10:B27)","v":356}]
["Artigas",43]
["Canelones",100]
["Cerro Largo",0]
["Colonia",37]
["Durazno",0]
["Flores",0]
["Florida",0]
["Lavalleja",0]
["Maldonado",99]
["Paysandú",0]
["Río Negro",0]
["Rivera",0]
["Rocha",0]
["Salto",43]
["San José",0]
["Soriano",0]
["Tacuarembó",34]
["Treinta y Tres",0]
[]
["Fuente: DE - CETP (UTU)"]

{"sheet":"II-8.1.7","index":102,"n_rows":40,"n_cols":3,"rows_kept":40,"cut":false,"hidden":false,"merged":[[0,0,1,1],[0,2,0,3],[4,0,4,3],[6,0,7,0],[6,1,7,1]]}
["CONSEJO DE EDUCACIÓN TÉCNICO PROFESIONAL (UTU)",null,"MATRICULADOS"]
[]
["Cuadro Nº II-8.1.7"]
[]
["ESTUDIANTES MATRICULADOS EN EDUCACIÓN TÉCNICA POR TIPO DE CURSO SEGÚN ÁREAS Y SECTORES DE ESTUDIO (TODO EL PAÍS, 2017)"]
[]
["ÁREAS Y SECTOR DE ESTUDIO","Total"]
[]
["TOTAL",{"$f":"B10+B14+B25+B27+B29+B32+B36","v":2942}]
["AGRICULTURA Y PESCA",{"$f":"B12+B11+B13","v":91}]
["Agropecuario",39]
["Hortifruticultura y jardinería",21]
["Náutica y Pesca",31]
["INDUSTRIA",{"$f":"SUM(B15:B24)","v":991}]
["Caucho, Plástico y Fibra de Vidrio",42]
["Cerámica",101]
["Cuero y Calzado",53]
["Electricidad y Electrónica",110]
["Gráficos",29]
["Madera y Muebles",106]
["Metal - Mecánica",215]
["Producción de Alimentos",97]
["Química, Termodinámica y Agroener.",56]
["Textil y Confección de Vestimenta",182]
["PERIODISMO Y COMUNICACIÓN",{"$f":"B26","v":42}]
["Comunicación",42]
["CONSTRUCCIÓN",{"$f":"B28","v":165}]
["Construcción y Arquitectura",165]
["COMERCIO,ADMINIST,INFORM Y COMUNICACIÓN",{"$f":"B30+B31","v":246}]
["Comercio y administración",54]
["Informática",192]
["SERVICIOS",{"$f":"B33+B34+B35","v":595}]
["Gastronomía",434]
["Servicios personales",116]
["Servicios a la producción",45]
["ARTES Y HUMANIDADES",812]
["Artes y artesanías",812]
["Fuente: DE - UTU"]
["Nota: El presente cuadro no incluye las Áreas y Sectores de Estudios contenidos en Educación "]
["      Media Básica y Superior, en tanto solo aplican para dichos niveles "]

{"sheet":"II-8.1.8  ","index":103,"n_rows":99,"n_cols":10,"rows_kept":99,"cut":false,"hidden":false,"merged":[[8,5,8,6],[8,8,8,9],[93,0,93,9],[98,0,98,13],[0,5,1,7],[6,0,6,9],[7,0,9,0],[7,1,9,1],[7,2,7,3],[7,4,9,4],[7,5,7,6],[7,7,9,7],[7,8,7,9],[8,2,8,3]]}
["MEC - DIRECCIÓN DE EDUCACIÓN",null,null,null,null,"MATRICULADOS"]
["ÁREA DE EDUCACIÓN NO FORMAL"]
[]
[]
["Cuadro Nº II-8.1.8"]
[]
["ESTUDIANTES INGRESADOS, MATRICULADOS Y EGRESADOS EN CECAP POR SEXO, SEGÚN DEPARTAMENTO Y EDAD (Todo el país, 2017)"]
["DEPARTAMENTO Y EDAD","TOTAL ","INGRESADOS",null,"TOTAL ","MATRICULADOS",null,"TOTAL ","EGRESADOS"]
[null,null,"SEXO",null,null,"SEXO",null,null,"SEXO"]
[null,null,"V","M",null,"V","M",null,"V","M"]
["TOTAL",{"$f":"SUM(C11:D11)","v":1514},{"$f":"+C13+C21","v":827},{"$f":"+D13+D21","v":687},{"$f":"SUM(E13+E21)","v":2190},{"$f":"+F13+F21","v":1199},{"$f":"+G13+G21","v":991},{"$f":"I11+J11","v":328},{"$f":"+I13+I21","v":195},{"$f":"+J13+J21","v":133}]
[]
["MONTEVIDEO",{"$f":"SUM(C13:D13)","v":449},{"$f":"C14+C17","v":236},{"$f":"D14+D17","v":213},{"$f":"F13+G13","v":495},{"$f":"F14+F17","v":266},{"$f":"G14+G17","v":229},{"$f":"I13+J13","v":109},{"$f":"I14+I17","v":63},{"$f":"J14+J17","v":46}]
["Montevideo",{"$f":"SUM(C14:D14)","v":387},{"$f":"C15+C16","v":200},{"$f":"D15+D16","v":187},{"$f":"F14+G14","v":424},{"$f":"F15+F16","v":221},{"$f":"G15+G16","v":203},{"$f":"I14+J14","v":106},{"$f":"I15+I16","v":62},{"$f":"J15+J16","v":44}]
["    14 a 17 años",374,192,182,399,208,191,106,62,44]
["    18 años y más",13,8,5,25,13,12,0]
["Montevideo Oeste",62,{"$f":"C18+C19","v":36},{"$f":"D18+D19","v":26},71,{"$f":"F18+F19","v":45},{"$f":"G18+G19","v":26},3,{"$f":"I18+I19","v":1},{"$f":"J18+J19","v":2}]
["    14 a 17 años",54,31,23,62,39,23,1,0,1]
["    18 años y más",8,5,3,9,6,3,2,1,1]
[]
["RESTO DEL PAÍS",{"$f":"C21+D21","v":1065},{"$f":"C22+C23","v":591},{"$f":"D22+D23","v":474},{"$f":"F21+G21","v":1695},{"$f":"F22+F23","v":933},{"$f":"G22+G23","v":762},{"$f":"I21+J21","v":219},{"$f":"I22+I23","v":132},{"$f":"J22+J23","v":87}]
["    14 a 17 años",{"$f":"C22+D22","v":844},{"$f":"C26+C31+C34+C37+C40+C43+C47+C51+C55+C59+C63+C67+C72+C75+C79+C83+C87+C91","v":470},{"$f":"D26+D31+D34+D37+D40+D43+D47+D51+D55+D59+D63+D67+D72+D75+D79+D83+D87+D91","v":374},{"$f":"F22+G22","v":1308},{"$f":"F26+F31+F34+F37+F40+F43+F47+F51+F55+F59+F63+F67+F72+F75+F79+F83+F87+F91","v":733},{"$f":"G26+G31+G34+G37+G40+G43+G47+G51+G55+G59+G63+G67+G72+G75+G79+G83+G87+G91","v":575},{"$f":"I22+J22","v":107},{"$f":"I26+I31+I34+I37+I40+I43+I47+I51+I55+I59+I63+I67+I72+I75+I79+I83+I87+I91","v":63},{"$f":"J26+J31+J34+J37+J40+J43+J47+J51+J55+J59+J63+J67+J72+J75+J79+J83+J87+J91","v":44}]
["    18 años y más",{"$f":"C23+D23","v":221},{"$f":"C27+C32+C35+C38+C41+C44+C48+C52+C56+C60+C64+C68+C73+C76+C80+C84+C88+C92","v":121},{"$f":"D27+D32+D35+D38+D41+D44+D48+D52+D56+D60+D64+D68+D73+D76+D80+D84+D88+D92","v":100},{"$f":"F23+G23","v":387},{"$f":"F27+F32+F35+F38+F41+F44+F48+F52+F56+F60+F64+F68+F73+F76+F80+F84+F88+F92","v":200},{"$f":"G27+G32+G35+G38+G41+G44+G48+G52+G56+G60+G64+G68+G73+G76+G80+G84+G88+G92","v":187},{"$f":"I23+J23","v":112},{"$f":"I27+I32+I35+I38+I41+I44+I48+I52+I56+I60+I64+I68+I73+I76+I80+I84+I88+I92","v":69},{"$f":"J27+J32+J35+J38+J41+J44+J48+J52+J56+J60+J64+J68+J73+J76+J80+J84+J88+J92","v":43}]
[]
["Artigas",{"$f":"C25+D25","v":44},{"$f":"C26+C27","v":20},{"$f":"D26+D27","v":24},{"$f":"F25+G25","v":58},{"$f":"F26+F27","v":31},{"$f":"G26+G27","v":27},{"$f":"I25+J25","v":13},{"$f":"I26+I27","v":8},{"$f":"J26+J27","v":5}]
["    14 a 17 años",34,15,19,42,25,17,{"$f":"I26+J26","v":5},4,1]
["    18 años y más",{"$f":"C27+D27","v":10},5,5,{"$f":"F27+G27","v":16},6,10,{"$f":"I27+J27","v":8},4,4]
[]
["Canelones",{"$f":"C29+D29","v":303},{"$f":"C30+C33+C36+C39+C42","v":167},{"$f":"D30+D33+D36+D39+D42","v":136},{"$f":"F29+G29","v":415},{"$f":"F30+F33+F36+F39+F42","v":221},{"$f":"G30+G33+G36+G39+G42","v":194},{"$f":"I29+J29","v":51},{"$f":"I30+I33+I36+I39+I42","v":31},{"$f":"J30+J33+J36+J39+J42","v":20}]
["   Barros Blancos",{"$f":"C30+D30","v":53},{"$f":"C31+C32","v":31},{"$f":"D31+D32","v":22},{"$f":"F30+G30","v":73},{"$f":"F31+F32","v":34},{"$f":"G31+G32","v":39},{"$f":"I30+J30","v":11},{"$f":"I31+I32","v":10},{"$f":"J31+J32","v":1}]
["    14 a 17 años",50,29,21,68,32,36,4,4,0]
["    18 años y más",3,2,1,5,2,3,7,6,1]
["   La Paz",43,{"$f":"C34+C35","v":23},{"$f":"D34+D35","v":20},90,{"$f":"F34+F35","v":57},{"$f":"G34+G35","v":33},23,{"$f":"I34+I35","v":14},{"$f":"J34+J35","v":9}]
["    14 a 17 años",41,21,20,81,51,30,19,13,6]
["    18 años y más",2,2,0,9,6,3,4,1,3]
["   Las Piedras",65,{"$f":"C37+C38","v":32},{"$f":"D37+D38","v":33},69,{"$f":"F37+F38","v":34},{"$f":"G37+G38","v":35},3,{"$f":"I37+I38","v":0},{"$f":"J37+J38","v":3}]
["    14 a 17 años",61,30,31,62,30,32,2,0,2]
["    18 años y más",4,2,2,7,4,3,1,0,1]
["   Paso Carrasco",60,{"$f":"C40+C41","v":35},{"$f":"D40+D41","v":25},69,{"$f":"F40+F41","v":40},{"$f":"G40+G41","v":29},2,{"$f":"I40+I41","v":2},{"$f":"J40+J41","v":0}]
["    14 a 17 años",60,35,25,67,39,28,2,2,0]
["    18 años y más",0,0,0,2,1,1,0,0,0]
["  Toledo",82,{"$f":"C43+C44","v":46},{"$f":"D43+D44","v":36},114,{"$f":"F43+F44","v":56},{"$f":"G43+G44","v":58},12,{"$f":"I43+I44","v":5},{"$f":"J43+J44","v":7}]
["    14 a 17 años",80,45,35,111,54,57,9,4,5]
["    18 años y más",2,1,1,3,2,1,3,1,2]
[]
["Colonia ",{"$f":"C46+D46","v":18},{"$f":"C47+C48","v":8},{"$f":"D47+D48","v":10},{"$f":"F46+G46","v":60},{"$f":"F47+F48","v":31},{"$f":"G47+G48","v":29},{"$f":"I46+J46","v":1},{"$f":"I47+I48","v":0},{"$f":"J47+J48","v":1}]
["    14 a 17 años",{"$f":"C47+D47","v":17},8,9,{"$f":"F47+G47","v":58},30,28,{"$f":"I47+J47","v":1},0,1]
["    18 años y más",1,0,1,2,1,1,0,0,0]
[]
["Durazno",{"$f":"C50+D50","v":65},{"$f":"C51+C52","v":43},{"$f":"D51+D52","v":22},{"$f":"F50+G50","v":90},{"$f":"F51+F52","v":59},{"$f":"G51+G52","v":31},{"$f":"I50+J50","v":16},{"$f":"SUM(I51:I52)","v":12},{"$f":"SUM(J51:J52)","v":4}]
["    14 a 17 años",60,40,20,77,50,27,{"$f":"I51+J51","v":14},10,4]
["    18 años y más",5,3,2,13,9,4,2,2,0]
[]
["Florida",{"$f":"C54+D54","v":59},{"$f":"C55+C56","v":32},{"$f":"D55+D56","v":27},{"$f":"F54+G54","v":120},{"$f":"F55+F56","v":61},{"$f":"G55+G56","v":59},{"$f":"I54+J54","v":16},{"$f":"I55+I56","v":7},{"$f":"J55+J56","v":9}]
["    14 a 17 años",{"$f":"C55+D55","v":59},32,27,{"$f":"F55+G55","v":117},58,59,{"$f":"I55+J55","v":14},5,9]
["    18 años y más",{"$f":"C56+D56","v":0},0,0,{"$f":"F56+G56","v":3},3,0,{"$f":"I56+J56","v":2},2,0]
[]
["Lavalleja (Minas)",{"$f":"C58+D58","v":41},{"$f":"C59+C60","v":20},{"$f":"D59+D60","v":21},{"$f":"F58+G58","v":41},{"$f":"F59+F60","v":20},{"$f":"G59+G60","v":21},{"$f":"I58+J58","v":0},{"$f":"I59+I60","v":0},{"$f":"J59+J60","v":0}]
["    14 a 17 años",{"$f":"C59+D59","v":34},19,15,{"$f":"F59+G59","v":34},19,15,{"$f":"I59+J59","v":0},0,0]
["    18 años y más",{"$f":"C60+D60","v":7},1,6,{"$f":"F60+G60","v":7},1,6,{"$f":"I60+J60","v":0},0,0]
[]
["Maldonado  ",{"$f":"SUM(C62:D62)","v":52},{"$f":"C63+C64","v":31},{"$f":"D63+D64","v":21},{"$f":"SUM(F62:G62)","v":114},{"$f":"F63+F64","v":68},{"$f":"G63+G64","v":46},{"$f":"SUM(I62:J62)","v":5},{"$f":"I63+I64","v":3},{"$f":"J63+J64","v":2}]
["    14 a 17 años",{"$f":"C63+D63","v":40},24,16,{"$f":"F63+G63","v":79},46,33,{"$f":"SUM(I63:J63)","v":2},1,1]
["    18 años y más",{"$f":"C64+D64","v":12},7,5,{"$f":"F64+G64","v":35},22,13,3,2,1]
[]
["Paysandú",{"$f":"C66+D66","v":48},{"$f":"C67+C68","v":26},{"$f":"D67+D68","v":22},{"$f":"F66+G66","v":136},{"$f":"F67+F68","v":83},{"$f":"G67+G68","v":53},{"$f":"I66+J66","v":4},{"$f":"I67+I68","v":3},{"$f":"J67+J68","v":1}]
["    14 a 17 años",{"$f":"C67+D67","v":40},22,18,{"$f":"F67+G67","v":107},67,40,{"$f":"I67+J67","v":3},2,1]
["    18 años y más",{"$f":"C68+D68","v":8},4,4,{"$f":"F68+G68","v":29},16,13,{"$f":"I68+J68","v":1},1,0]
[]
["Río Negro ",{"$f":"C70+D70","v":164},{"$f":"C71+C74","v":84},{"$f":"D71+D74","v":80},{"$f":"F70+G70","v":197},{"$f":"F71+F74","v":101},{"$f":"G71+G74","v":96},{"$f":"I70+J70","v":9},{"$f":"I71+I74","v":6},{"$f":"J71+J74","v":3}]
["Fray Bentos",{"$f":"C71+D71","v":97},{"$f":"C72+C73","v":40},{"$f":"D72+D73","v":57},{"$f":"F71+G71","v":97},{"$f":"F72+F73","v":40},{"$f":"G72+G73","v":57},{"$f":"I71+J71","v":0},{"$f":"I72+I73","v":0},{"$f":"J72+J73","v":0}]
["    14 a 17 años",57,24,33,57,24,33,0,0,0]
["    18 años y más",40,16,24,40,16,24,0,0,0]
["Young",67,{"$f":"C75+C76","v":44},{"$f":"D75+D76","v":23},100,{"$f":"F75+F76","v":61},{"$f":"G75+G76","v":39},9,{"$f":"I75+I76","v":6},{"$f":"J75+J76","v":3}]
["    14 a 17 años",62,41,21,89,55,34,9,6,3]
["    18 años y más",5,3,2,11,6,5,0,0,0]
[]
["Rivera",{"$f":"C78+D78","v":115},{"$f":"C79+C80","v":68},{"$f":"D79+D80","v":47},{"$f":"F78+G78","v":202},{"$f":"F79+F80","v":103},{"$f":"G79+G80","v":99},{"$f":"I78+J78","v":80},{"$f":"I79+I80","v":49},{"$f":"J79+J80","v":31}]
["    14 a 17 años",{"$f":"C79+D79","v":8},2,6,{"$f":"F79+G79","v":23},13,10,{"$f":"I79+J79","v":7},3,4]
["    18 años y más",{"$f":"C80+D80","v":107},66,41,{"$f":"F80+G80","v":179},90,89,{"$f":"I80+J80","v":73},46,27]
[]
["Salto",{"$f":"C82+D82","v":102},{"$f":"C83+C84","v":59},{"$f":"D83+D84","v":43},{"$f":"F82+G82","v":141},{"$f":"F83+F84","v":82},{"$f":"G83+G84","v":59},{"$f":"I82+J82","v":8},{"$f":"I83+I84","v":6},{"$f":"J83+J84","v":2}]
["    14 a 17 años",{"$f":"C83+D83","v":93},54,39,{"$f":"F83+G83","v":123},73,50,{"$f":"I83+J83","v":5},5,0]
["    18 años y más",{"$f":"C84+D84","v":9},5,4,{"$f":"F84+G84","v":18},9,9,{"$f":"I84+J84","v":3},1,2]
[]
["Soriano (Dolores)",{"$f":"C86+D86","v":15},{"$f":"C87+C88","v":9},{"$f":"D87+D88","v":6},{"$f":"F86+G86","v":15},{"$f":"F87+F88","v":9},{"$f":"G87+G88","v":6},{"$f":"I86+J86","v":0},{"$f":"I87+I88","v":0},{"$f":"J87+J88","v":0}]
["    14 a 17 años",{"$f":"C87+D87","v":12},6,6,{"$f":"F87+G87","v":12},6,6,{"$f":"I87+J87","v":0},0,0]
["    18 años y más",{"$f":"C88+D88","v":3},3,0,{"$f":"F88+G88","v":3},3,0,{"$f":"I88+J88","v":0},0,0]
[]
["Treinta y Tres",{"$f":"C90+D90","v":39},{"$f":"C91+C92","v":24},{"$f":"D91+D92","v":15},{"$f":"F90+G90","v":106},{"$f":"F91+F92","v":64},{"$f":"G91+G92","v":42},{"$f":"I90+J90","v":16},{"$f":"I91+I92","v":7},{"$f":"J91+J92","v":9}]
["    14 a 17 años",{"$f":"C91+D91","v":36},23,13,{"$f":"F91+G91","v":101},61,40,{"$f":"I91+J91","v":11},4,7]
["    18 años y más",{"$f":"C92+D92","v":3},1,2,{"$f":"F92+G92","v":5},3,2,{"$f":"I92+J92","v":5},3,2]
[]
["Fuente:  Área de Educación No Formal, Dirección de Educación, MEC."]
[]
["Nota:"]
[" Ingresos: Todos los individuos que comenzaron a cursar la propuesta educativa en el primer o segundo semestre del año 2017.(1er. SEMESTRE MARZO 2017 /1 er. SEMESTRE JULIO 2017)"]
["Matriculados: Todos los individuos que durante el año 2017 cursaron la propuesta educativa. (1er. 2do. 3er. 4to. Y Redescubrir si corresponde) +  los estudiantes de 1er. Semestre de Julio 2017 "]
[" Egresos: Todos los individuos que culminaron durante el 2017 los cuatro semestres que prevee la propuesta educativa. (los que terminaron 4to semestre en Julio y Diciembre 2017)"]

{"sheet":"II-8.1.9  ","index":104,"n_rows":96,"n_cols":7,"rows_kept":96,"cut":false,"hidden":false,"merged":[[92,0,92,6],[94,0,94,6],[95,0,95,6],[0,5,1,7],[6,0,6,6],[7,0,9,0],[7,1,9,1],[7,2,7,3],[7,4,9,4],[7,5,7,6],[8,2,8,3],[8,5,8,6]]}
["MEC - DIRECCIÓN DE EDUCACIÓN",null,null,null,null,"MATRICULADOS"]
["ÁREA DE EDUCACIÓN NO FORMAL"]
[]
[]
["Cuadro Nº II-8.1.9"]
[]
["ESTUDIANTES CON EGRESO ANTICIPADO Y DESVINCULADOS DE CECAP POR SEXO, SEGÚN DEPARTAMENTO Y EDAD (Todo el país, 2017)"]
["DEPARTAMENTO Y EDAD","TOTAL ","EGRESO ANTICIPADO",null,"TOTAL ","DESVINCULADOS"]
[null,null,"SEXO",null,null,"SEXO"]
[null,null,"V","M",null,"V","M"]
["TOTAL",{"$f":"SUM(C11:D11)","v":139},{"$f":"+C13+C20","v":87},{"$f":"+D13+D20","v":52},{"$f":"SUM(F11:G11)","v":519},{"$f":"+F13+F20","v":292},{"$f":"+G13+G20","v":227}]
[]
["MONTEVIDEO",{"$f":"SUM(C13:D13)","v":27},{"$f":"C14+C17","v":17},{"$f":"D14+D17","v":10},{"$f":"SUM(F13:G13)","v":149},{"$f":"F14+F17","v":78},{"$f":"G14+G17","v":71}]
["Montevideo",11,{"$f":"C15+C16","v":7},{"$f":"D15+D16","v":4},109,{"$f":"F15+F16","v":51},{"$f":"G15+G16","v":58}]
["    14 a 17 años",10,6,4,104,49,55]
["    18 años y más",1,1,0,5,2,3]
["Montevideo Oeste",16,{"$f":"C18+C19","v":10},{"$f":"D18+D19","v":6},40,{"$f":"F18+F19","v":27},{"$f":"G18+G19","v":13}]
["    14 a 17 años",15,9,6,34,23,11]
["    18 años y más",1,1,0,6,4,2]
["RESTO DEL PAÍS",{"$f":"+C20+D20","v":112},{"$f":"C21+C22","v":70},{"$f":"D21+D22","v":42},{"$f":"+F20+G20","v":370},{"$f":"F21+F22","v":214},{"$f":"G21+G22","v":156}]
["    14 a 17 años",{"$f":"+C21+D21","v":78},{"$f":"C25+C30+C33+C36+C39+C42+C46+C50+C54+C58+C62+C66+C71+C74+C78+C83+C87+C91","v":48},{"$f":"D25+D30+D33+D36+D39+D42+D46+D50+D54+D58+D62+D66+D71+D74+D78+D83+D87+D91","v":30},321,{"$f":"F25+F30+F33+F36+F39+F42+F46+F50+F54+F58+F62+F66+F71+F74+F78+F83+F87+F91","v":187},{"$f":"G25+G30+G33+G36+G39+G42+G46+G50+G54+G58+G62+G66+G71+G74+G78+G83+G87+G91","v":134}]
["    18 años y más",34,{"$f":"C26+C31+C34+C37+C40+C43+C47+C51+C55+C59+C63+C67+C72+C75+C79+C84+C88+C92","v":22},{"$f":"D26+D31+D34+D37+D40+D43+D47+D51+D55+D59+D63+D67+D72+D75+D79+D84+D88+D92","v":12},49,{"$f":"F26+F31+F34+F37+F40+F43+F47+F51+F55+F59+F63+F67+F72+F75+F79+F84+F88+F92","v":27},{"$f":"G26+G31+G34+G37+G40+G43+G47+G51+G55+G59+G63+G67+G72+G75+G79+G84+G88+G92","v":22}]
[]
["Artigas",{"$f":"SUM(C24:D24)","v":8},{"$f":"SUM(C25:C26)","v":6},{"$f":"SUM(D25:D26)","v":2},{"$f":"SUM(F24:G24)","v":25},{"$f":"SUM(F25:F26)","v":15},{"$f":"SUM(G25:G26)","v":10}]
["    14 a 17 años",{"$f":"SUM(C25:D25)","v":6},4,2,{"$f":"SUM(F25:G25)","v":24},15,9]
["    18 años y más",{"$f":"SUM(C26:D26)","v":2},2,0,{"$f":"SUM(F26:G26)","v":1},0,1]
[]
["Canelones",{"$f":"SUM(C28:D28)","v":14},{"$f":"C29+C32+C35+C38+C41","v":8},{"$f":"D29+D32+D35+D38+D41","v":6},{"$f":"SUM(F28:G28)","v":139},{"$f":"F29+F32+F35+F38+F41","v":68},{"$f":"G29+G32+G35+G38+G41","v":71}]
["  Barros Blancos",{"$f":"SUM(C29:D29)","v":0},{"$f":"SUM(C30:C31)","v":0},{"$f":"SUM(D30:D31)","v":0},49,{"$f":"SUM(F30:F31)","v":23},{"$f":"SUM(G30:G31)","v":26}]
["    14 a 17 años",0,0,0,34,16,18]
["    18 años y más",0,0,0,15,7,8]
["  La Paz",3,{"$f":"SUM(C33:C34)","v":2},{"$f":"SUM(D33:D34)","v":1},32,{"$f":"SUM(F33:F34)","v":14},{"$f":"SUM(G33:G34)","v":18}]
["    14 a 17 años",1,0,1,31,13,18]
["    18 años y más",2,2,0,1,1,0]
["Las Piedras",5,{"$f":"SUM(C36:C37)","v":4},{"$f":"SUM(D36:D37)","v":1},7,{"$f":"SUM(F36:F37)","v":4},{"$f":"SUM(G36:G37)","v":3}]
["    14 a 17 años",3,2,1,6,3,3]
["    18 años y más",2,2,0,1,1,0]
["Paso Carrasco",{"$f":"SUM(C38:D38)","v":1},{"$f":"C39+C40","v":1},{"$f":"D39+D40","v":0},{"$f":"SUM(F38:G38)","v":30},{"$f":"F39+F40","v":16},{"$f":"G39+G40","v":14}]
["    14 a 17 años",1,1,0,30,16,14]
["    18 años y más",0,0,0,0,0,0]
["Toledo",{"$f":"SUM(C41:D41)","v":5},{"$f":"C42+C43","v":1},{"$f":"D42+D43","v":4},{"$f":"SUM(F41:G41)","v":21},{"$f":"F42+F43","v":11},{"$f":"G42+G43","v":10}]
["    14 a 17 años",{"$f":"SUM(C42:D42)","v":3},1,2,{"$f":"SUM(F42:G42)","v":21},11,10]
["    18 años y más",{"$f":"SUM(C43:D43)","v":2},0,2,{"$f":"SUM(F43:G43)","v":0},0,0]
[]
["Colonia ",{"$f":"SUM(C45:D45)","v":4},{"$f":"C46+C47","v":2},{"$f":"D46+D47","v":2},{"$f":"SUM(F45:G45)","v":9},{"$f":"F46+F47","v":7},{"$f":"G46+G47","v":2}]
["    14 a 17 años",{"$f":"SUM(C46:D46)","v":4},2,2,{"$f":"SUM(F46:G46)","v":9},7,2]
["    18 años y más",{"$f":"SUM(C47:D47)","v":0},0,0,{"$f":"SUM(F47:G47)","v":0},0,0]
[]
["Durazno",{"$f":"SUM(C49:D49)","v":5},{"$f":"SUM(C50:C51)","v":3},{"$f":"SUM(D50:D51)","v":2},{"$f":"SUM(F49:G49)","v":33},{"$f":"SUM(F50:F51)","v":22},{"$f":"SUM(G50:G51)","v":11}]
["    14 a 17 años",{"$f":"SUM(C50:D50)","v":4},2,2,{"$f":"SUM(F50:G50)","v":29},21,8]
["    18 años y más",{"$f":"SUM(C51:D51)","v":1},1,0,{"$f":"SUM(F51:G51)","v":4},1,3]
[]
["Florida",{"$f":"SUM(C53:D53)","v":9},{"$f":"SUM(C54:C55)","v":7},{"$f":"SUM(D54:D55)","v":2},{"$f":"SUM(F53:G53)","v":24},{"$f":"SUM(F54:F55)","v":18},{"$f":"SUM(G54:G55)","v":6}]
["    14 a 17 años",{"$f":"SUM(C54:D54)","v":9},7,2,{"$f":"SUM(F54:G54)","v":24},18,6]
["    18 años y más",{"$f":"SUM(C55:D55)","v":0},0,0,{"$f":"SUM(F55:G55)","v":0},0,0]
[]
["Lavalleja (Minas)",{"$f":"SUM(C57:D57)","v":11},{"$f":"SUM(C58:C59)","v":7},{"$f":"SUM(D58:D59)","v":4},{"$f":"SUM(F57:G57)","v":18},{"$f":"SUM(F58:F59)","v":7},{"$f":"SUM(G58:G59)","v":11}]
["    14 a 17 años",{"$f":"SUM(C58:D58)","v":11},7,4,{"$f":"SUM(F58:G58)","v":16},7,9]
["    18 años y más",{"$f":"SUM(C59:D59)","v":0},0,0,{"$f":"SUM(F59:G59)","v":2},0,2]
[]
["Maldonado ",{"$f":"SUM(C61:D61)","v":6},{"$f":"SUM(C62:C63)","v":3},{"$f":"SUM(D62:D63)","v":3},{"$f":"SUM(F61:G61)","v":18},{"$f":"SUM(F62:F63)","v":10},{"$f":"SUM(G62:G63)","v":8}]
["    14 a 17 años",0,0,0,13,7,6]
["    18 años y más",6,3,3,5,3,2]
[]
["Paysandú",{"$f":"SUM(C65:D65)","v":19},{"$f":"C66+C67","v":11},{"$f":"D66+D67","v":8},{"$f":"SUM(F65:G65)","v":17},{"$f":"F66+F67","v":8},{"$f":"G66+G67","v":9}]
["    14 a 17 años",14,9,5,11,5,6]
["    18 años y más",5,2,3,6,3,3]
[]
["Río Negro ",10,{"$f":"C70+C73","v":2},{"$f":"D70+D73","v":8},28,{"$f":"F70+F73","v":10},{"$f":"G70+G73","v":18}]
["Fray Bentos",3,{"$f":"C71+C72","v":1},{"$f":"D71+D72","v":2},8,{"$f":"F71+F72","v":5},{"$f":"G71+G72","v":3}]
["    14 a 17 años",0,0,0,3,1,2]
["    18 años y más",3,1,2,5,4,1]
["Young",7,1,6,20,5,15]
["    14 a 17 años",1,1,0,18,11,7]
["    18 años y más",0,0,0,0,0,0]
[]
["Rivera",{"$f":"SUM(C77:D77)","v":25},{"$f":"C78+C79","v":16},{"$f":"D78+D79","v":9},{"$f":"SUM(F77:G77)","v":54},{"$f":"F78+F79","v":38},{"$f":"G78+G79","v":16}]
["    14 a 17 años",{"$f":"SUM(C78:D78)","v":16},9,7,{"$f":"SUM(F78:G78)","v":46},32,14]
["    18 años y más",{"$f":"SUM(C79:D79)","v":9},7,2,{"$f":"SUM(F79:G79)","v":8},6,2]
[]
[]
["Salto",{"$f":"SUM(C82:D82)","v":0},{"$f":"C83+C84","v":0},{"$f":"D83+D84","v":0},{"$f":"SUM(F82:G82)","v":5},{"$f":"F83+F84","v":3},{"$f":"G83+G84","v":2}]
["    14 a 17 años",{"$f":"SUM(C83:D83)","v":0},0,0,{"$f":"SUM(F83:G83)","v":5},3,2]
["    18 años y más",{"$f":"SUM(C84:D84)","v":0},0,0,{"$f":"SUM(F84:G84)","v":0},0,0]
[]
["Soriano (Dolores)",{"$f":"SUM(C86:D86)","v":0},{"$f":"C87+C88","v":0},{"$f":"D87+D88","v":0},{"$f":"SUM(F86:G86)","v":0},{"$f":"F87+F88","v":0},{"$f":"G87+G88","v":0}]
["    14 a 17 años",{"$f":"SUM(C87:D87)","v":0},0,0,{"$f":"SUM(F87:G87)","v":0},0,0]
["    18 años y más",{"$f":"SUM(C88:D88)","v":0},0,0,{"$f":"SUM(F88:G88)","v":0},0,0]
[]
["Treinta y Tres",{"$f":"SUM(C90:D90)","v":7},{"$f":"C91+C92","v":5},{"$f":"D91+D92","v":2},{"$f":"SUM(F90:G90)","v":2},{"$f":"F91+F92","v":2},{"$f":"G91+G92","v":0}]
["    14 a 17 años",{"$f":"SUM(C91:D91)","v":5},3,2,{"$f":"SUM(F91:G91)","v":1},1,0]
["    18 años y más",{"$f":"SUM(C92:D92)","v":2},2,0,{"$f":"SUM(F92:G92)","v":1},1,0]
["Fuente:  Área de Educación No Formal, Dirección de Educación, MEC."]
["Notas:"]
["Egreso Anticipado: Todos los individuos que durante el 2017 egresaron de CECAP para incorporarse a otra propuesta educativa o al mundo del trabajo, habiendo cursado un período menor a cuatro semestres."]
["Desvinculados: Todos los individuos que durante el 2017 dejaron de asistir a la propuesta."]

{"sheet":"II-8.1.10  ","index":105,"n_rows":277,"n_cols":10,"rows_kept":277,"cut":false,"hidden":false,"merged":[[6,5,6,6],[6,8,6,9],[0,5,1,8],[4,0,4,9],[5,0,7,0],[5,1,7,1],[5,2,5,3],[5,4,7,4],[5,5,5,6],[5,7,7,7],[5,8,5,9],[6,2,6,3]]}
["INSTITUCIONES UNIVERSITARIAS: OFERTAS EDUCATIVAS NO TERCIARIAS",null,null,null,null,"MATRICULADOS"]
[]
["Cuadro Nº II- 8.1.10"]
[]
["ESTUDIANTES INGRESADOS, MATRICULADOS Y EGRESADOS EN OFERTAS EDUCATIVAS NO TERCIARIAS DE UNIVERSIDADES PRIVADAS POR SEXO (Todo el país, 2017)"]
["UNIVERSIDAD / ACREDITACIÓN","TOTAL","INGRESADOS",null,"TOTAL","MATRICULADOS",null,"TOTAL","EGRESADOS"]
[null,null,"SEXO",null,null,"SEXO",null,null,"SEXO"]
[null,null,"V","M",null,"V","M",null,"V","M"]
["TOTAL",{"$f":"B11+B37+B52+B168+B191+B237+B241+B262","v":6521},{"$f":"+C11+C37+C52+C168+C191+C237+C241+C262","v":2305},{"$f":"+D11+D37+D52+D168+D191+D237+D241+D262","v":2456},{"$f":"E11+E37+E52+E168+E191+E237+E241+E262","v":8466},{"$f":"+F11+F37+F52+F168+F191+F237+F241+F262","v":3619},{"$f":"+G11+G37+G52+G168+G191+G237+G241+G262","v":3087},{"$f":"H11+H37+H52+H168+H191+H237+H241+H262","v":3493},{"$f":"+I11+I37+I52+I168+I191+I237+I241+I262","v":1492},{"$f":"+J11+J37+J52+J168+J191+J237+J241+J262","v":1157}]
[]
["UNIVERSIDAD ORT URUGUAY ",{"$f":"SUM(C11:D11)","v":847},{"$f":"SUM(C12:C35)","v":599},{"$f":"SUM(D12:D35)","v":248},{"$f":"SUM(F11:G11)","v":2560},{"$f":"SUM(F12:F35)","v":1795},{"$f":"SUM(G12:G35)","v":765},{"$f":"SUM(I11:J11)","v":486},{"$f":"SUM(I12:I35)","v":325},{"$f":"SUM(J12:J35)","v":161}]
["Analista en Comercio Exterior",{"$f":"+C12+D12","v":35},18,17,{"$f":"+F12+G12","v":99},57,42,{"$f":"+I12+J12","v":24},10,14]
["Analista en Comunicación Corporativa y Relaciones Públicas",24,7,17,67,24,43,12,3,9]
["Analista en Marketing",86,40,46,265,136,129,64,29,35]
["Analista en Publicidad y Comunicación Digital",31,16,15,45,20,25,1,0,1]
["Analista en Redes Sociales y Community Management",1,0,1,17,4,13,3,1,2]
["Analista en Tecnologías de la Información",114,106,8,377,328,49,18,13,5]
["Analista Programador",150,127,23,483,415,68,58,47,11]
["Analista Programador de Aplicaciones Web",0,0,0,2,1,1,0,0,0]
["Diseñador Gráfico",42,15,27,152,60,92,22,6,16]
["Productor de Modas",0,0,0,8,0,8,7,0,7]
["Programador  Web",13,10,3,30,22,8,80,69,11]
["Técnico en Diseño de Sonido",34,30,4,94,83,11,15,14,1]
["Técnico en Diseño Web",27,12,15,68,35,33,15,7,8]
["Técnico en Electro Electrónica",15,14,1,44,40,4,5,5,0]
["Técnico en Electrónica Informática",2,2,0,8,7,1,16,16,0]
["Técnico en Gerencia",60,37,23,179,85,94,18,6,12]
["Técnico en Gerencia Comercial",47,39,8,108,85,23,18,13,5]
["Técnico en Gerencia Turística",21,13,8,62,29,33,7,3,4]
["Técnico en Producción Musical",9,6,3,21,16,5,10,9,1]
["Técnico en Realización Audiovisual",21,13,8,54,33,21,19,9,10]
["Técnico en Relaciones Públicas y Organización de Eventos",23,8,15,51,14,37,6,1,5]
["Técnico en Sistemas Eléctricos y Electrónicos",24,24,0,55,54,1,12,12,0]
["Técnico en Sistemas Operativos y Redes",45,41,4,195,178,17,22,22,0]
["Técnico en Soporte Informático",23,21,2,76,69,7,34,30,4]
[]
["UNIVERSIDAD DE LA EMPRESA",{"$f":"SUM(C37:D37)","v":139},{"$f":"C38+C48+C50","v":85},{"$f":"D38+D48+D50","v":54},{"$f":"SUM(F37:G37)","v":279},{"$f":"F38+F48+F50","v":163},{"$f":"G38+G48+G50","v":116},{"$f":"SUM(I37:J37)","v":75},{"$f":"I38+I48+I50","v":41},{"$f":"J38+J48+J50","v":34}]
["Montevideo",{"$f":"SUM(C38:D38)","v":116},{"$f":"SUM(C39:C46)","v":70},{"$f":"SUM(D39:D46)","v":46},{"$f":"SUM(F38:G38)","v":249},{"$f":"SUM(F39:F46)","v":148},{"$f":"SUM(G39:G46)","v":101},{"$f":"SUM(I38:J38)","v":71},{"$f":"SUM(I39:I46)","v":41},{"$f":"SUM(J39:J46)","v":30}]
["Técnico Agropecuario",{"$f":"SUM(C39:D39)","v":33},25,8,76,63,13,40,30,10]
["Técnico en Ciencias Veterinarias",12,4,8,26,8,18,3,1,2]
["Técnico en Gestión de Equinos",16,13,3,25,14,11,0,0,0]
["Técnico Forestal",9,8,1,24,21,3,9,5,4]
["Técnico Veterinario",19,7,12,40,14,26,7,2,5]
["Analista en Técnología Informática",16,13,3,32,28,4,3,3,0]
["Técnico en Diseño Gráfico",1,0,1,4,0,4,0,0,0]
["Técnico en Diseño de Interiores",10,0,10,22,0,22,9,0,9]
["Colonia"]
["Técnico en Diseño Gráfico",6,1,5,13,1,12,4,0,4]
["Florida"]
["Técnico Agropecuario",{"$f":"SUM(C50:D50)","v":17},14,3,17,14,3,0,0,0]
[]
["UCUDAL",{"$f":"B53+B157+B158+B162+B164+B166","v":2715},954,1666,2716,955,1666,1428,750,678]
["Montevideo",{"$f":"SUM(B54:B155)","v":2589},{"$f":"SUM(C54:C155)","v":927},1567,{"$f":"SUM(E54:E155)","v":2590},928,1567,{"$f":"SUM(H54:H155)","v":1322},{"$f":"SUM(I54:I155)","v":665},{"$f":"SUM(J54:J155)","v":657}]
["Mediación en salud: prevención y gestión extrajudicial de conflictos sanitarios",{"$f":"C54+D54","v":29},9,20,{"$f":"F54+G54","v":29},9,20,{"$f":"I54+J54","v":0},0,0]
["Litigación oral",{"$f":"C55+D55","v":30},5,25,{"$f":"F55+G55","v":30},5,25,{"$f":"I55+J55","v":0},0,0]
["Contratos: de la redacción al juzgado",19,6,13,19,6,13,0,0,0]
["Mediación Penal",25,6,19,25,6,19,0,0,0]
["La mediación en el ámbito familiar",29,10,19,29,10,19,0,0,0]
["Derecho de Arrendamientos Urbanos",28,6,22,28,6,22,0,0,0]
["Responsabilidad Civil Profundizada",39,16,23,39,16,23,0,0,0]
["Ciclo de Simposios Notariales 2017 | Contratos Preliminares",26,5,21,26,5,21,0,0,0]
["Negociación en la gestión de conflictos laborales",25,7,18,25,7,18,0,0,0]
["Derecho Sucesorio",35,9,26,35,9,26,0,0,0]
["Terceras Conferencias Jurídico Notariales",101,19,82,101,19,82,0,0,0]
["Derecho del Deporte",33,21,12,33,21,12,0,0,0]
["La nulidad matrimonial canónica y su proceso. Actualidad y novedades",14,6,8,14,6,8,0,0,0]
["3er Seminario sobre la Reforma del Proceso Penal",63,13,50,63,13,50,0,0,0]
["Sociedades comerciales en tiempos revueltos",79,6,73,79,6,73,0,0,0]
["6ta Jornada Internacional de Derecho Administrativo | Contencioso administrativo y tutela jurisdiccional efectiva",62,19,43,62,19,43,0,0,0]
["El arte de mediar",15,6,9,16,7,9,0,0,0]
["Proyecto de energías renovables: historia, presente y futuro",10,4,6,10,4,6,0,0,0]
["Taller jurídico con Referentes Comunitarios",45,"s/d","s/d",45,"s/d","s/d",0,0,0]
["Interpretación y argumentación jurídica",{"$f":"C73+D73","v":26},7,19,{"$f":"F73+G73","v":26},7,19,0,0,0]
["Instrumentos para una efectiva tutela del crédito",17,7,10,17,7,10,0,0,0]
["Estudio de Títulos y Proceso Dominial",54,8,46,54,8,46,0,0,0]
["Derecho de Familia y Sucesiones",38,3,35,38,3,35,0,0,0]
["Curso de Contratación Pública",53,17,36,53,17,36,0,0,0]
["15° Jornadas Interuniversitarias de Derecho Constitucional y Derechos Humanos",138,53,85,138,53,85,0,0,0]
["Propiedad Horizontal",40,9,31,40,9,31,0,0,0]
["Mediación en el ámbito educativo | Tacuarembó",13,1,12,13,1,12,0,0,0]
["Curso Tendencias y Desafíos en la regulación del tiempo de trabajo",10,1,9,10,1,9,0,0,0]
["Nuevo Código del Proceso Penal | Paysandú",45,16,29,45,16,29,0,0,0]
["Taller jurídico para la comunidad",50,"s/d","s/d",50,"s/d","s/d",0,0,0]
["Métodos de resolución alternativa de conflictos",26,6,20,26,6,20,0,0,0]
["Diploma como Asesor en Lactancia Materna",21,0,21,21,0,21,12,12,0]
["Certificado de Formación en Logística (CFL)",9,8,1,9,8,1,9,8,1]
["Certificado en Manejo de Inversiones Financieras (CMIF)",22,17,5,22,17,5,22,17,5]
["Certificado en Prevención del Lavado de Dinero y Financiamiento al Terrorismo (CPLD)",39,10,29,39,10,29,39,10,29]
["Diploma de Formación en Logística (DFL)",3,2,1,3,2,1,3,2,1]
["Gestión de Organizaciones de Alto Desempeño (GAD)",17,4,13,17,4,13,17,4,13]
["Programa de Desarrollo Directivo - PDD (matutino)",26,9,17,26,9,17,26,9,17]
["Programa de Desarrollo Directivo - PDD (vespertino)",19,9,10,19,9,10,19,9,10]
["Programa de Formación en Logística - PFL",14,10,4,14,10,4,14,10,4]
["Programa de Dirección General (PDG)",12,9,3,12,9,3,12,9,3]
["Programa de Formación Comercial (Grupo PFC matutino)",16,9,7,16,9,7,16,9,7]
["Programa de Formación Comercial (Grupo PFC vespertino)",25,13,12,25,13,12,25,13,12]
["Programa de Formación en Gestión de Proyectos (GP) - Grupo 1",34,10,24,34,10,24,34,10,24]
["Programa de Formación en Gestión de Proyectos (GP) - Grupo 2",26,16,10,26,16,10,26,16,10]
["Programa de Gestión de Abastecimientos (PGA)",18,12,6,18,12,6,18,12,6]
["Programa de Gestión Humana Estratégica (GHE)",20,3,17,20,3,17,20,3,17]
["CFL - Taller: Diseño y Operación de Centros de distribución",15,14,1,15,14,1,15,14,1]
["CFL - Taller: Logística Internacional",12,10,2,12,10,2,12,10,2]
["CFL - Taller: Planificación y control de operaciones.",15,13,2,15,13,2,15,13,2]
["Coaching aplicado al desarrollo de vendedores",15,7,8,15,7,8,15,7,8]
["Gestión del cambio",23,16,7,23,16,7,23,16,7]
["Impacto de la capacitación",27,10,17,27,10,17,27,10,17]
["Influencia Estratégica",10,6,4,10,6,4,10,6,4]
["Inteligencia emocional",19,7,12,19,7,12,19,7,12]
["La delegación facultativa",26,14,12,26,14,12,26,14,12]
["La nueva función del Líder",13,4,9,13,4,9,13,4,9]
["La venta relacional",16,12,4,16,12,4,16,12,4]
["Manejo estratégico del tiempo",27,12,15,27,12,15,27,12,15]
["Motivación y reconocimiento",19,9,10,19,9,10,19,9,10]
["Profesionalice sus presentaciones orales - Grupo 1",17,9,8,17,9,8,17,9,8]
["Profesionalice sus presentaciones orales - Grupo 2",9,5,4,9,5,4,9,5,4]
["Reuniones Efectivas",11,2,9,11,2,9,11,2,9]
["Viviendo Scrum",21,9,12,21,9,12,21,9,12]
["Calidad de Servicio - Franklin Covey",20,7,13,20,7,13,20,7,13]
["Coaching - Franklin Covey",12,3,9,12,3,9,{"$f":"I119+J119","v":12},3,9]
["Conversaciones Cruciales y Manejo del Stress  - Franklin Covey",17,7,10,17,7,10,17,7,10]
["Liderazgo Intergeneracional - Franklin Covey",13,2,11,13,2,11,13,2,11]
["Los 7 Hábitos de la Gente Altamente Efectiva - Franklin Covey",26,14,12,26,14,12,26,14,12]
["Negociar  - Franklin Covey",29,14,15,29,14,15,29,14,15]
["Customer Experience Day",66,25,41,66,25,41,66,25,41]
["Industria 4.0: tendencias globales y relevancia para el Uruguay",35,26,9,35,26,9,35,26,9]
["Conferencia: Cómo competir cuando le llegue su ´UBER´ a mi negocio\"",43,31,12,43,31,12,43,31,12]
["Construyendo ámbitos de trabajo saludables - Del Burn-Out al Engagement",43,13,30,43,13,30,43,13,30]
["Riesgos y Prevención de lavado de activos en Negocios Fiduciarios.",25,9,16,25,9,16,25,9,16]
["Design Thinking para la toma de decisiones y solución de problemas complejos - Grupo 1",27,16,11,27,16,11,27,16,11]
["Design Thinking para la toma de decisiones y solución de problemas complejos - Grupo 2",27,18,9,27,18,9,27,18,9]
["Workshop Marca Empleadora",18,3,15,18,3,15,18,3,15]
["Adm. Epresarial",12,4,8,12,4,8,9,8,1]
["Asistente en Marketing",9,5,4,9,5,4,8,4,4]
["Asistente en Comercio Exterior",14,8,6,14,8,6,9,3,6]
["Corredor Inmobiliario",10,4,6,10,4,6,7,4,3]
["Diseño de Interiores",24,3,21,24,3,21,17,15,2]
["Asistente Financiero Contable",10,1,9,10,1,9,8,7,1]
["Habilidades de Coaching",{"$f":"C138+D138","v":14},1,13,{"$f":"F138+G138","v":14},1,13,8,8]
["Marketing Digital",19,7,12,19,7,12,12,7,5]
["Supervisor en Operaciones y Logística",8,4,4,8,4,4,8,4,4]
["Asistente en recursos Humanos",15,2,13,15,2,13,14,13,1]
["Seguridad e Higiene en el Trabajo",8,null,8,8,0,8,8,8]
["Sup. Gestión y Control",8,5,3,8,5,3,6,2,4]
["Visitador Médico",42,27,15,42,27,15,38,15,23]
["Métodos de interpetación y análisis de diseños de Regresión discontinua",14,9,5,14,9,5,14,9,5]
["Introducción a la Estimación de Modelos de Máxima Verosimilitud",3,1,2,3,1,2,3,1,2]
["An introduction to effective visualization",14,8,6,14,8,6,14,8,6]
["Metodologías de Encuesta",13,4,9,13,4,9,13,4,9]
["Conceptos, tipologías e índices",10,1,9,10,1,9,10,1,9]
["Inferencia causal con métodos cualitativos",28,5,23,28,5,23,28,5,23]
["Introducción al análisis de datos de panel",13,7,6,13,7,6,13,7,6]
["Análisis espacial con sistemas de información geográfica",13,6,7,13,6,7,13,6,7]
["Web scrapping, social media y Big data en política",31,14,17,31,14,17,31,14,17]
["Modelos Euclídeos de elección y comportamiento político: Interpretación y Estimación Empírica",8,6,2,8,6,2,8,6,2]
["Experimentos aleatorizados: principios y práctica",15,6,9,15,6,9,15,6,9]
["Flores"]
["Idóneo en farmacia",{"$f":"C157+D157","v":24},0,24,{"$f":"F157+G157","v":24},0,24,{"$f":"I157+J157","v":22},22,0]
["Maldonado ",43,{"$f":"C159+C160","v":16},{"$f":"D159+D160","v":27},43,{"$f":"F159+F160","v":16},{"$f":"G159+G160","v":27},39,{"$f":"I159+I160","v":24},{"$f":"J159+J160","v":15}]
["Idóneo en farmacia",31,6,25,31,6,25,27,22,5]
["Supervisor en Operaciones y Logística",12,10,2,12,10,2,12,2,10]
["Paysandú"]
["Idóneo en farmacia",34,4,30,34,4,30,26,24,2]
["Rivera"]
["Idóneo en farmacia",{"$f":"C164+D164","v":15},4,11,15,4,11,9,8,1]
["Salto"]
["Idóneo en farmacia",{"$f":"C166+D166","v":10},3,7,10,3,7,10,7,3]
[]
["UNIVERSIDAD DE LA REPÚBLICA",{"$f":"C168+D168","v":471},{"$f":"C169+C185+C187+C189","v":158},{"$f":"D169+D185+D187+D189","v":313},{"$f":"F168+G168","v":471},{"$f":"F169+F185+F187+F189","v":158},{"$f":"G169+G185+G187+G189","v":313},{"$f":"I168+J168","v":238},{"$f":"I169+I185+I187+I189","v":54},{"$f":"J169+J185+J187+J189","v":184}]
["Montevideo",417,{"$f":"SUM(C170:C183)","v":112},{"$f":"SUM(D170:D183)","v":305},417,{"$f":"SUM(F170:F183)","v":112},{"$f":"SUM(G170:G183)","v":305},219,{"$f":"SUM(I170:I183)","v":38},{"$f":"SUM(J170:J183)","v":181}]
["Preuniversitario Canto",8,4,4,8,4,4,0,0,0]
[" Preuniversitario Clarinete",3,3,0,3,3,0,0,0,0]
[" Preuniversitario Contrabajo",2,1,1,2,1,1,2,2,0]
[" Preuniversitario Flauta",2,2,0,2,2,0,0,0,0]
[" Preuniversitario Guitarra",14,10,4,14,10,4,1,0,1]
[" Preuniversitario Oboe ",1,1,0,1,1,0,0,0,0]
[" Preuniversitario Percusion ",4,3,1,4,3,1,1,1,0]
[" Preuniversitario Piano ",15,11,4,15,11,4,1,1,0]
["Preuniversitario Saxofon ",2,2,0,2,2,0,1,1,0]
["Preuniversitario Violin",4,2,2,4,2,2,0,0,0]
["Preuniversitario Violoncello",5,1,4,5,1,4,1,0,1]
["Guardavidas ",12,11,1,12,11,1,15,12,3]
["Auxiliar de Enfermería ",0,null,null,0,null,null,68,6,62]
["Auxiliar de Farmacia Hospitalaria",345,61,284,345,61,284,129,15,114]
["Maldonado"]
["Guardavidas ",0,0,0,0,0,0,1,1,0]
["Paysandú"]
["Guardavidas ",{"$f":"C187+D187","v":0},0,0,{"$f":"F187+G187","v":0},0,0,{"$f":"I187+J187","v":1},1,0]
["Salto"]
["Guardavidas ",54,46,8,{"$f":"F189+G189","v":54},46,8,{"$f":"I189+J189","v":17},14,3]
[]
["IPES",{"$f":"B192+B228+B230+B232+B234","v":1665},"s/d","s/d",{"$f":"E192+E228+E230+E232+E234","v":1665},"s/d","s/d",{"$f":"H192+H228+H230+H232+H234","v":844},"s/d","s/d"]
["Montevideo",{"$f":"SUM(B193:B223)","v":1609},"s/d","s/d",{"$f":"SUM(E193:E223)","v":1609},"s/d","s/d",{"$f":"SUM(H193:H227)","v":797},"s/d","s/d"]
["Curso de Actualización \"¿Qué es cocinar para un Químico?\"",40,"s/d","s/d",40,"s/d","s/d",27,"s/d","s/d"]
["Actualización en Histología y Biología celular",20,"s/d","s/d",20,"s/d","s/d",20,"s/d","s/d"]
["Audiovisual en la práctica educativa de las Ciencias",38,"s/d","s/d",38,"s/d","s/d",12,"s/d","s/d"]
["Biogeografía",48,"s/d","s/d",48,"s/d","s/d",48,"s/d","s/d"]
["Certificado Perfeccionamiento en Educación Inicial para Maestro/as de Educación Común- CEIP.",170,"s/d","s/d",170,"s/d","s/d",122,"s/d","s/d"]
["Curso de Actualización \"Falacias\"",67,"s/d","s/d",67,"s/d","s/d",0,"s/d","s/d"]
["Curso de Actualización Perspectivas de desarrollo en Uruguay y la región",81,"s/d","s/d",81,"s/d","s/d",0,"s/d","s/d"]
["Curso de desarrollo profesional para docentes Adscriptores en ejercicio",220,"s/d","s/d",220,"s/d","s/d",173,"s/d","s/d"]
["Curso de especialización fase II- Adolescencias y construcciones desde la perspectiva audiovisual. Un abordaje interdisciplinario",19,"s/d","s/d",19,"s/d","s/d",0,"s/d","s/d"]
["Curso \"Posgrado en Didáctica de la Geografía 2017- 2da. Cohorte\"",23,"s/d","s/d",23,"s/d","s/d",22,"s/d","s/d"]
["Curso \"Posgrado Geografía del mundo Musulmán\"",22,"s/d","s/d",22,"s/d","s/d",23,"s/d","s/d"]
["Discapacidad intelectual ( curso dentro del Posgrado)",27,"s/d","s/d",27,"s/d","s/d",0,"s/d","s/d"]
["Educación Ambiental para Docentes",56,"s/d","s/d",56,"s/d","s/d",28,"s/d","s/d"]
["Educación Ambiental para Inspectores",5,"s/d","s/d",5,"s/d","s/d",3,"s/d","s/d"]
["Educación Ambiental en ámbitos rurales: el agua como eje",16,"s/d","s/d",16,"s/d","s/d",4,"s/d","s/d"]
["Educar desde la perspectiva de Derechos Humanos",64,"s/d","s/d",64,"s/d","s/d",0,"s/d","s/d"]
["Enseñanza de la Ecología en el Patio de la Escuela",12,"s/d","s/d",12,"s/d","s/d",12,"s/d","s/d"]
["Entomología Acuática",12,"s/d","s/d",12,"s/d","s/d",12,"s/d","s/d"]
["Evaluación de Aprendizaje en Ciencias",48,"s/d","s/d",48,"s/d","s/d",25,"s/d","s/d"]
["Evaluación de los Aprendizajes en el aula",12,"s/d","s/d",12,"s/d","s/d",5,"s/d","s/d"]
["Evaluación en un modelo curricular basado en competencias",23,"s/d","s/d",23,"s/d","s/d",12,"s/d","s/d"]
["Curso teórico práctico de tutorías para docentes Adscriptores en ejercico",22,"s/d","s/d",22,"s/d","s/d",22,"s/d","s/d"]
["Formación de tutores en acompañamiento de las Trayectorias Educativas",127,"s/d","s/d",127,"s/d","s/d",56,"s/d","s/d"]
["Historia de la Química",19,"s/d","s/d",19,"s/d","s/d",15,"s/d","s/d"]
["Introducción a la realización audiovisual para la mejora de la enseñanza ",30,"s/d","s/d",30,"s/d","s/d",30,"s/d","s/d"]
["Lengua y Literatura para la Primera Infancia",76,"s/d","s/d",76,"s/d","s/d",0,"s/d","s/d"]
["Los consumos problemáticos: conceptualización y abordaje en la educación",132,"s/d","s/d",132,"s/d","s/d",39,"s/d","s/d"]
["Neurociencia ",29,"s/d","s/d",29,"s/d","s/d",29,"s/d","s/d"]
["Taller \"Planeta azul desde la perspectiva Uruguaya\"",24,"s/d","s/d",24,"s/d","s/d",11,"s/d","s/d"]
["Curso de Actualización “Un enfoque interdisciplinario y transdisciplinario en lenguajes artístico” ",55,"s/d","s/d",55,"s/d","s/d",0,"s/d","s/d"]
["Curso semipresencial \" Desarrollo Profesional para el Acompañamiento a Docentes y Educadores Noveles\"",72,"s/d","s/d",72,"s/d","s/d",0,"s/d","s/d"]
["Actualización disciplinar y Didáctica en Astronomía",0,"s/d","s/d",0,"s/d","s/d",3,"s/d","s/d"]
["Neurociencias y su implicancia en los procesos de enseñanza y aprendizaje",0,"s/d","s/d",0,"s/d","s/d",27,"s/d","s/d"]
["Profundización en Didáctica de la Ciencia",0,"s/d","s/d",0,"s/d","s/d",13,"s/d","s/d"]
["Curso –taller:” Recursos educativos: De recursos didácticos a fuentes de información”",0,"s/d","s/d",0,"s/d","s/d",4,"s/d","s/d"]
["Colonia",1,"s/d","s/d",1,"s/d","s/d",1,"s/d","s/d"]
["Historia de la Química",1,"s/d","s/d",1,"s/d","s/d",1,"s/d","s/d"]
["Río Negro",28,"s/d","s/d",28,"s/d","s/d",28,"s/d","s/d"]
["Curso- taller \"Cooperación y Cooperativismo en la Educación\"",28,"s/d","s/d",28,"s/d","s/d",28,"s/d","s/d"]
["Rivera",10,"s/d","s/d",10,"s/d","s/d",5,"s/d","s/d"]
["Historia de la Química",10,"s/d","s/d",10,"s/d","s/d",5,"s/d","s/d"]
["Salto",17,"s/d","s/d",17,"s/d","s/d",13,"s/d","s/d"]
["Historia de la Química",17,"s/d","s/d",17,"s/d","s/d",13,"s/d","s/d"]
[]
["Instituto Metodista Universitario Crandon",{"$f":"C237+D237","v":0},{"$f":"C238+C239","v":0},{"$f":"D238+D239","v":0},{"$f":"F237+G237","v":26},{"$f":"F238+F239","v":0},{"$f":"G238+G239","v":26},{"$f":"I237+J237","v":0},{"$f":"I238+I239","v":0},{"$f":"J238+J239","v":0}]
["Asistente Ejecutivo",0,0,0,6,0,6,0,0,0]
["Secretariado Ejecutivo",0,0,0,20,0,20,0,0,0]
[]
["Instituto Universitario Asociación Cristiana de Jóvenes",376,{"$f":"SUM(C242:C260)","v":338},{"$f":"SUM(D242:D260)","v":38},441,{"$f":"SUM(F242:F260)","v":377},{"$f":"SUM(G242:G260)","v":64},234,{"$f":"SUM(I242:I260)","v":209},{"$f":"SUM(J242:J260)","v":25}]
["Instructorado en Fitness con orientacion en Modalidades de Gimnasia y/o Entrenamiento Personalizado",9,6,3,16,11,5,6,4,2]
["Curso Técnico Deportivo en Atletismo",5,4,1,6,5,1,1,0,1]
["Curso Técnico Deportivo en Basketball",4,4,0,8,8,0,5,5,0]
["Curso Técnico Deportivo en Gimnasia Artística",11,0,11,20,1,19,3,0,3]
["Curso Técnico Deportivo en Handball",0,0,0,7,6,1,1,1]
["Curso Técnico Deportivo en Natación",16,9,7,38,21,17,17,12,5]
["Curso Técnico Deportivo en Hockey s/césped",0,0,0,2,0,2,2,0,2]
["Curso Técnico de Fútbol Base",115,113,2,115,113,2,51,45,6]
["Curso Técnico de Fútbol Amateur",79,74,5,79,74,5,49,46,3]
["Curso Técnico de Fútbol de Divisiones Juveniles",58,54,4,58,54,4,53,51,2]
["Curso Técnico de Fútbol Profesional",49,48,1,49,48,1,43,42,1]
["Instructorado en Fitness con orientacion en Modalidades de Gimnasia y/o Entrenamiento Personalizado",6,3,3,8,5,3,0,0,0]
["Curso Técnico Deportivo en Gimnasia Artística",0,0,0,1,0,1,0,0,0]
["Curso Técnico Deportivo en Natación",0,0,0,2,1,1,1,1,0]
["Curso Técnico Deportivo en Hockey s/césped",0,0,0,1,0,1,0,0,0]
["Curso Técnico Deportivo en Karate",0,0,0,4,4,0,0,0,0]
["Curso Técnico Deportivo en Levantamiento de Pesas",0,0,0,3,3,0,1,1,0]
["Curso Técnico de Fútbol Base",13,12,1,13,12,1,0,0,0]
["Curso Técnico de Fútbol Amateur",11,11,0,11,11,0,1,1,0]
[]
["CENTRO DE ALTOS ESTUDIOS NACIONALES (CALEN)",308,{"$f":"SUM(C263:C274)","v":171},{"$f":"SUM(D263:D274)","v":137},308,{"$f":"SUM(F263:F274)","v":171},{"$f":"SUM(G263:G274)","v":137},188,{"$f":"SUM(I263:I274)","v":113},{"$f":"SUM(J263:J274)","v":75}]
["Política y Estrategia",41,26,15,41,26,15,20,15,5]
["Análisis de la Información Estratégica",20,14,6,20,14,6,12,9,3]
["Ciberseguridad",42,25,17,42,25,17,26,15,11]
["Seguridad y Defensa",24,12,12,24,12,12,16,8,8]
["Género en Temas de Defensa Nacional",16,4,12,16,4,12,9,3,6]
["Prospectiva aplicada a la Defensa Nacional",26,18,8,26,18,8,16,14,2]
["Geopolítica y Geoestrategia del Uruguay",33,15,18,33,15,18,20,8,12]
["Metodología de la Investigación",13,8,5,13,8,5,8,5,3]
["Met. De la Invest. Técnicas  Análisis Cualitativas",13,4,9,13,4,9,7,2,5]
["Aproximación al Terrorismo fenómeno afecta Seg. Inter.",41,29,12,41,29,12,30,21,9]
["Metodología de la Investigación: Análisis Estadistico",22,7,15,22,7,15,9,2,7]
["Aspectos Jurídicos de la Defensa Nacional",17,9,8,17,9,8,15,11,4]
[]
[]
["Fuente: Oficinas Productoras de cada una de las Instituciones. "]

{"sheet":"II-8.2.1  ","index":106,"n_rows":100,"n_cols":8,"rows_kept":100,"cut":false,"hidden":false,"merged":[[99,0,99,6],[0,4,1,5],[4,0,4,8],[5,0,8,0],[5,1,8,1],[5,2,5,5],[5,6,7,7],[6,2,6,3],[6,4,6,5],[7,2,7,5]]}
["MEC - DIRECCIÓN DE EDUCACIÓN",null,null,null,"PERSONAL DOCENTE"]
["ÁREA DE EDUCACIÓN NO FORMAL"]
[]
["Cuadro Nº II-8.2.1"]
["PERSONAL DOCENTE DE CECAP,TITULADO Y NO TITULADO, POR SEXO, REGIÓN Y DEPARTAMENTO SEGÚN CARGA HORARIA SEMANAL                       (Todo el país, 2017)"]
["Dedicación","TOTAL DOCENTES","DOCENTES",null,null,null,"PERSONAL NO DOCENTE"]
[null,null,"TITULADOS",null,"NO TITULADOS"]
[null,null,"SEXO"]
[null,null,"V","M","V","M","V","M"]
["TOTAL",{"$f":"SUM(C10:F10)","v":289},{"$f":"+C12+C22","v":45},{"$f":"+D12+D22","v":120},59,65,5,20]
[]
["MONTEVIDEO",{"$f":"SUM(C12:F12)","v":77},{"$f":"C13+C17","v":17},{"$f":"D13+D17","v":35},10,15,2,7]
["Montevideo",{"$f":"SUM(C13:F13)","v":65},{"$f":"C14+C15+C16","v":14},{"$f":"D14+D15+D16","v":33},7,11,2,6]
["Hasta 19 hs semanales",{"$f":"SUM(C14:F14)","v":9},1,4,4,0,0,0]
["De 20 hs a 39 hs semanales",53,10,29,3,11,2,6]
["De 40 hs y más semanales",3,3,0,0,0,0,0]
["Montevideo Oeste",12,{"$f":"C18+C19+C20","v":3},{"$f":"D18+D19+D20","v":2},3,4,0,1]
["Hasta 19 hs semanales",8,2,2,3,1,0,1]
["De 20 hs a 39 hs semanales",4,1,0,0,3,0,0]
["De 40 hs y más semanales",0,0,0,0,0,0,0]
[]
["RESTO DEL PAÍS",{"$f":"SUM(C22:F22)","v":212},{"$f":"SUM(C23:C25)","v":28},{"$f":"SUM(D23:D25)","v":85},{"$f":"SUM(E23:E25)","v":49},{"$f":"SUM(F23:F25)","v":50},{"$f":"SUM(G23:G25)","v":3},13]
["Hasta 19 hs semanales",{"$f":"SUM(C23:F23)","v":105},{"$f":"C27+C32+C36+C40+C44+C48+C52+C56+C64+C68+C72+C76+C80+C84+C88+C92+C96","v":17},{"$f":"D27+D32+D36+D40+D44+D48+D52+D56+D64+D68+D72+D76+D80+D84+D88+D92+D96","v":27},30,31,1,4]
["De 20 hs a 39 hs semanales",{"$f":"SUM(C24:F24)","v":102},{"$f":"C28+C33+C37+C41+C45+C49+C53+C57+C65+C69+C73+C77+C81+C85+C89+C93+C97","v":8},58,17,19,2,8]
["De 40 hs y más semanales",5,{"$f":"C29+C34+C38+C42+C46+C50+C54+C58+C64+C70+C74+C78+C82+C86+C90+C94+C98","v":3},{"$f":"D29+D34+D38+D42+D46+D50+D54+D58+D64+D70+D74+D78+D82+D86+D90+D94+D98","v":0},2,0,0,1]
["Artigas",15,{"$f":"SUM(C27:C29)","v":5},3,3,4,0,0]
["Hasta 19 hs semanales",10,4,0,2,4,0,0]
["De 20 hs a 39 hs semanales",5,1,3,1,0,0,0]
["De 40 hs y más semanales",0,0,0,0,0,0,0]
["Canelones",{"$f":"SUM(C30:F30)","v":54},{"$f":"+C31+C35+C39+C43+C47","v":4},20,14,16,0,1]
["  Barros Blancos",9,{"$f":"SUM(C32:C34)","v":2},4,2,1,0,0]
["Hasta 19 hs semanales",6,1,2,2,1,0,0]
["De 20 hs a 39 hs semanales",{"$f":"SUM(C33:F33)","v":2},0,2,0,0,0,0]
["De 40 hs y más semanales",1,1,0,0,0,0,0]
["  La Paz",12,{"$f":"SUM(C36:C38)","v":1},{"$f":"SUM(D36:D38)","v":6},{"$f":"SUM(E36:E38)","v":1},{"$f":"SUM(F36:F38)","v":4},{"$f":"SUM(G36:G38)","v":0},0]
["Hasta 19 hs semanales",4,1,2,0,1,0,0]
["De 20 hs a 39 hs semanales",8,0,4,1,3,0,0]
["De 40 hs y más semanales",0,0,0,0,0,0,0]
["  Las Piedras",12,{"$f":"SUM(C40:C42)","v":0},{"$f":"SUM(D40:D42)","v":6},{"$f":"SUM(E40:E42)","v":2},{"$f":"SUM(F40:F42)","v":4},{"$f":"SUM(G40:G42)","v":0},0]
["Hasta 19 hs semanales",8,0,2,2,4,0,0]
["De 20 hs a 39 hs semanales",4,0,4,0,0,0,0]
["De 40 hs y más semanales",0,0,0,0,0,0,0]
["Paso Carrasco",{"$f":"SUM(C43:F43)","v":10},{"$f":"SUM(C44:C46)","v":0},{"$f":"SUM(D44:D46)","v":2},{"$f":"SUM(E44:E46)","v":4},{"$f":"SUM(F44:F46)","v":4},{"$f":"SUM(G44:G46)","v":0},1]
["Hasta 19 hs semanales",7,0,0,3,4,0,1]
["De 20 hs a 39 hs semanales",3,0,2,1,0,0,0]
["De 40 hs y más semanales",{"$f":"SUM(C46:F46)","v":0},0,0,0,0,0,0]
["  Toledo",11,{"$f":"SUM(C48:C50)","v":1},{"$f":"SUM(D48:D50)","v":2},{"$f":"SUM(E48:E50)","v":5},{"$f":"SUM(F48:F50)","v":3},{"$f":"SUM(G48:G50)","v":0},0]
["Hasta 19 hs semanales",5,0,1,3,1,0,0]
["De 20 hs a 39 hs semanales",6,1,1,2,2,0,0]
["De 40 hs y más semanales",0,0,0,0,0,0,0]
["Colonia ",{"$f":"SUM(C51:F51)","v":11},{"$f":"SUM(C52:C54)","v":1},{"$f":"SUM(D52:D54)","v":3},{"$f":"SUM(E52:E54)","v":2},{"$f":"SUM(F52:F54)","v":5},{"$f":"SUM(G52:G54)","v":0},2]
["Hasta 19 hs semanales",{"$f":"SUM(C52:F52)","v":5},0,0,2,3,0,1]
["De 20 hs a 39 hs semanales",6,1,3,0,2,0,1]
["De 40 hs y más semanales",0,0,0,0,0,0,0]
["Durazno",9,{"$f":"SUM(C56:C58)","v":1},6,2,0,0,0]
["Hasta 19 hs semanales",4,1,1,2,0,0,0]
["De 20 hs a 39 hs semanales",5,0,5,0,0,0,0]
["De 40 hs y más semanales",0,0,0,0,0,0,0]
["Florida",14,0,9,3,2,0,0]
["Hasta 19 hs semanales",8,"s/d","s/d","s/d","s/d","s/d","s/d"]
["De 20 hs a 39 hs semanales",6,"s/d","s/d","s/d","s/d","s/d","s/d"]
["De 40 hs y más semanales",0,"s/d","s/d","s/d","s/d","s/d","s/d"]
["Lavalleja (Minas)",8,{"$f":"C64+C65+C66","v":2},{"$f":"D64+D65+D66","v":3},{"$f":"E64+E65+E66","v":2},1,0,1]
["Hasta 19 hs semanales",4,2,0,2,0,0,1]
["De 20 hs a 39 hs semanales",4,0,3,0,1,0,0]
["De 40 hs y más semanales",0,0,0,0,0,0,0]
["Maldonado",12,{"$f":"C68+C69+C70","v":1},{"$f":"D68+D69+D70","v":6},{"$f":"E68+E69+E70","v":4},1,0,0]
["Hasta 19 hs semanales",7,1,3,3,0,0,0]
["De 20 hs a 39 hs semanales",5,0,3,1,1,0,0]
["De 40 hs y más semanales",0,0,0,0,0,0,0]
["Paysandú",13,{"$f":"SUM(C72:C74)","v":2},{"$f":"SUM(D72:D74)","v":3},{"$f":"SUM(E72:E74)","v":4},{"$f":"SUM(F72:F74)","v":4},0,1]
["Hasta 19 hs semanales",8,2,2,2,2,0,1]
["De 20 hs a 39 hs semanales",5,0,1,2,2,0,0]
["De 40 hs y más semanales",0,0,0,0,0,0,0]
["Río Negro (Fray Bentos)",{"$f":"SUM(C75:F75)","v":13},{"$f":"SUM(C76:C78)","v":3},{"$f":"SUM(D76:D78)","v":6},{"$f":"SUM(E76:E78)","v":2},{"$f":"SUM(F76:F78)","v":2},0,1]
["Hasta 19 hs semanales",8,2,3,1,2,0,0]
["De 20 hs a 39 hs semanales",5,1,3,1,0,0,0]
["De 40 hs y más semanales",0,0,0,0,0,0,0]
["Río Negro (Young)",13,{"$f":"SUM(C80:C82)","v":1},{"$f":"SUM(D80:D82)","v":6},{"$f":"SUM(E80:E82)","v":1},{"$f":"SUM(F80:F82)","v":5},{"$f":"SUM(G80:G82)","v":0},1]
["Hasta 19 hs semanales",9,1,3,1,4,0,0]
["De 20 hs a 39 hs semanales",4,0,3,0,1,0,1]
["De 40 hs y más semanales",0,0,0,0,0,0,0]
["Rivera",26,{"$f":"SUM(C84:C86)","v":2},{"$f":"SUM(D84:D86)","v":9},{"$f":"SUM(E84:E86)","v":8},{"$f":"SUM(F84:F86)","v":7},{"$f":"SUM(G84:G86)","v":2},6]
["Hasta 19 hs semanales",1,0,0,0,1,0,0]
["De 20 hs a 39 hs semanales",25,2,9,8,6,2,6]
["De 40 hs y más semanales",0,0,0,0,0,0,0]
["Salto",17,{"$f":"SUM(C88:C90)","v":3},{"$f":"SUM(D88:D90)","v":12},{"$f":"SUM(E88:E90)","v":0},{"$f":"SUM(F88:F90)","v":2},{"$f":"SUM(G88:G90)","v":1},0]
["Hasta 19 hs semanales",9,2,5,0,2,1,0]
["De 20 hs a 39 hs semanales",8,1,7,0,0,0,0]
["De 40 hs y más semanales",0,0,0,0,0,0,0]
["Soriano (Dolores)",3,{"$f":"SUM(C92:C94)","v":1},{"$f":"SUM(D92:D94)","v":2},{"$f":"SUM(E92:E94)","v":0},{"$f":"SUM(F92:F94)","v":0},{"$f":"SUM(G92:G94)","v":0},0]
["Hasta 19 hs semanales",1,0,1,0,0,0,0]
["De 20 hs a 39 hs semanales",2,1,1,0,0,0,0]
["De 40 hs y más semanales",0,0,0,0,0,0,0]
["Treinta y Tres",14,{"$f":"SUM(C96:C98)","v":0},{"$f":"SUM(D96:D98)","v":6},{"$f":"SUM(E96:E98)","v":5},{"$f":"SUM(F96:F98)","v":3},{"$f":"SUM(G96:G98)","v":0},0]
["Hasta 19 hs semanales",9,0,2,5,2,0,0]
["De 20 hs a 39 hs semanales",5,0,4,0,1,0,0]
["De 40 hs y más semanales",0,0,0,0,0,0,0]
[]
["Fuente: Procesamiento propio en base a datos proporcionados por el  Área de Educación No Formal, Dirección de Educación, MEC."]

{"sheet":"ll-8.2.2","index":107,"n_rows":30,"n_cols":4,"rows_kept":30,"cut":false,"hidden":false,"merged":[[5,0,6,0],[5,1,6,1],[3,0,3,3],[5,2,5,3],[0,1,0,3],[1,0,1,2]]}
["ANEP","PERSONAL DOCENTE",null,"PRUEBAS DE ACREDITACIÓN"]
["CODICEN – DIRECCIÓN SECTORIAL DE EDUCACIÓN DE ADULTOS"]
["Cuadro Nº II-8.2.2"]
["DOCENTES POR SEXO SEGÚN GRANDES ÁREAS Y DEPARTAMENTO (Todo el país)*"]
[]
["GRANDES ÁREAS Y DEPARTAMENTOS",null,"DOCENTES"]
[null,null,"VARÓN","MUJER"]
["TOTAL",{"$f":"+B9+B10","v":433},{"$f":"+C9+C10","v":91},342]
["MONTEVIDEO",{"$f":"C9+D9","v":261},59,202]
["RESTO DEL PAÍS",{"$f":"C10+D10","v":172},32,140]
["Artigas",{"$f":"C11+D11","v":5},0,5]
["Canelones",46,7,39]
["Cerro Largo",7,1,6]
["Colonia",8,0,8]
["Durazno",4,0,4]
["Flores",1,0,1]
["Florida",3,0,3]
["Lavalleja",7,2,5]
["Maldonado",9,4,5]
["Paysandú",12,2,10]
["Río Negro",5,1,4]
["Rivera",14,4,10]
["Rocha",3,1,2]
["Salto",13,4,9]
["San José",9,2,7]
["Soriano",12,2,10]
["Tacuarembó",13,2,11]
["Treinta y Tres",1,0,1]
["Fuente: ANEP - CODICEN - Dirección Sectorial de Educación de Adultos"]
["Nota : * los datos corresponden al año 2013. Últimos datos disponibles."]

{"sheet":"II-8.3.1   ","index":108,"n_rows":24,"n_cols":12,"rows_kept":24,"cut":false,"hidden":false,"merged":[[0,0,0,2],[0,4,1,11],[6,0,6,11],[7,0,10,0],[7,1,8,2],[7,3,10,3],[7,4,8,5],[7,6,8,11],[9,1,10,1],[9,2,10,2],[9,4,9,5],[9,6,10,6],[9,7,9,8],[9,9,10,9],[9,10,9,11]]}
["CONSEJO DE CAPACITACIÓN PROFESIONAL (COCAP)",null,null,null,"CURSOS, ESTUDIANTES Y PERSONAL"]
[]
[]
[]
["Cuadro Nº II-8.3.1"]
[]
["CANTIDAD DE CURSOS, DE HORAS Y DE ESTUDIANTES MATRICULADOS SEGÚN TIPO DE CURSO Y ÁREA DE FORMACIÓN COCAP             (Todo el país, 2017)"]
["TIPO DE CURSO Y ÁREA DE FORMACIÓN","CURSOS",null,"TOTAL","ESTUDIANTES MATRICULADOS",null,"RECURSOS HUMANOS"]
[]
[null,"CANTIDAD","HORAS",null,"SEXO",null,"TOTAL","DOCENTES",null,"TOTAL","FUNCIONARIOS"]
[null,null,null,null,"V","M",null,"V","M",null,"V","M"]
["TOTAL",{"$f":"B13+B18","v":116},{"$f":"SUM(C13+C18)","v":10990},{"$f":"E12+F12","v":1022},{"$f":"E13+E18","v":956},{"$f":"F13+F18","v":66},{"$f":"H12+I12","v":45},{"$f":"H13+H18","v":36},{"$f":"I13+I18","v":9},{"$f":"K12+L12","v":32},{"$f":"K13+K18","v":12},{"$f":"L13+L18","v":20}]
["   Cursos Abiertos",{"$f":"SUM(B14:B17)","v":109},{"$f":"SUM(C14:C17)","v":9749},{"$f":"E13+F13","v":918},{"$f":"SUM(E14:E17)","v":876},{"$f":"SUM(F14:F17)","v":42},{"$f":"H13+I13","v":34},{"$f":"SUM(H14:H17)","v":30},{"$f":"SUM(I14:I17)","v":4},{"$f":"K13+L13","v":25},10,15]
["    Industrial",98,8516,795,774,21,{"$f":"H14+I14","v":29},25,4,0,0,0]
["    Hotelería / Gastronomía",0,0,0,0,0,0,0,0,0,0,0]
["    Administración y Servicios",9,1077,106,86,20,4,4,0,0,0,0]
["    Agropecuario",2,156,17,16,1,1,1,0,0,0,0]
["   Cursos Cerrados",{"$f":"SUM(B19:B22)","v":7},{"$f":"SUM(C19:C22)","v":1241},104,{"$f":"SUM(E19:E22)","v":80},{"$f":"SUM(F19:F22)","v":24},11,{"$f":"SUM(H19:H22)","v":6},{"$f":"SUM(I19:I22)","v":5},7,2,5]
["    Industrial",4,267,53,49,4,4,4,0,0,0,0]
["    Hotelería / Gastronomía",1,395,21,14,7,1,0,1,0,0,0]
["    Administración y Servicios",2,579,30,17,13,6,2,4,0,0,0]
["    Agropecuario",0,0,0,0,0,0,0,0,0,0,0]
[]
["Fuente: COCAP"]

{"sheet":"II-8.4.1  ","index":109,"n_rows":419,"n_cols":9,"rows_kept":419,"cut":false,"hidden":false,"merged":[[4,0,4,6],[5,0,7,0],[5,1,7,1],[5,2,5,4],[5,5,7,5],[5,6,5,7],[6,2,6,4],[6,6,6,7]]}
["MEC"]
["División de Investigación y Estadística"]
[]
["Cuadro  II- 8.4.1"]
["MATRÍCULA Y PERSONAL DOCENTE DEL RELEVAMIENTO DE INSTITUCIONES DE OFERTA DE FORMACIÓN EN EDUCACIÓN NO FORMAL POR SEXO SEGÚN TIPO DE INSTITUCIÓN E INSTITUCIONES. (Todo el país, 2017)"]
["TIPO DE INSTITUCIÓN /  INSTITUCIONES","TOTAL","MATRÍCULA",null,null,"TOTAL","DOCENTES"]
[null,null,"SEXO",null,null,null,"SEXO"]
[null,null,"M","F","SD",null,"M","F"]
["TOTAL PÚBLICO Y PRIVADA",80226,35340,44882,4,7639,2761,4878]
["PÚBLICO TOTAL",6905,4628,2276,1,773,485,288]
["Brigada Aérea II (Escuadrón de vuelo avanzado)",50,46,4,0,27,24,3]
["C.I.B.M.",187,184,3,0,"s/d","s/d","s/d"]
["C.I.P.T.M.E.",22,21,1,0,"s/d","s/d","s/d"]
["Centro de Formación Penitenciaria del Uruguay",996,384,612,0,132,62,70]
["Centro de instrucción de artillería de campaña y antiaérea \"Coronel Antonio E. Trifoglio\"",144,138,6,0,16,16,0]
["Centro de instrucción de infantería",552,529,23,0,"s/d","s/d","s/d"]
["Centro de instrucción de ingenieros",488,481,7,0,"s/d","s/d","s/d"]
["Centro de instrucción de la Armada",602,436,166,0,95,83,12]
["Centro de instrucción de paracaidistas y operaciones especiales del Ejército",186,184,2,0,"s/d","s/d","s/d"]
["Comando de apoyo logístico del Ejército",41,38,3,0,"s/d","s/d","s/d"]
["E.I.E.",233,198,35,0,"s/d","s/d","s/d"]
["ESANA",136,106,30,0,40,37,3]
["Escuela de administración militar \"General Edgardo U. Genta\"",10,7,3,0,"s/d","s/d","s/d"]
["Escuela de comunicaciones del Ejército",244,200,44,0,4,3,1]
["Escuela de Equitación del Ejército Grito de Asencio",51,50,1,0,"s/d","s/d","s/d"]
["Escuela de Músicos del Ejército",68,54,14,0,10,5,5]
["Escuela de Sanidad de las Fuerzas Armadas",806,286,520,0,212,109,103]
["Escuela militar de aeronáutica",64,52,12,0,56,41,15]
["Facultad Latinoamericana de Ciencias Sociales - Programa Uruguay",616,65,551,0,42,5,37]
["Grupo de buceo y salvamento de la Armada",34,34,0,0,64,62,2]
["I.M.A.E.",377,367,10,0,"s/d","s/d","s/d"]
["I.M.E.S.",67,61,6,0,21,11,10]
["Instituto Militar de Estudios Superiores 1",25,17,8,0,14,9,5]
["Instituto Militar de Estudios Superiores 2",185,96,89,0,16,5,11]
["Instituto Militar de Estudios Superiores 3",12,8,4,0,2,2,0]
["Instituto Militar de Estudios Superiores 4",31,19,12,0,2,2,0]
["Instituto militar de las armas y especialiadades - Escuela de educación física y tiro del Ejército",148,139,9,0,4,4,0]
["Instituto militar de las armas y especialidades - Escuela de capacitación y perfeccionamiento de oficiales",87,74,12,1,1,1,0]
["Movimiento nacional de recuperación de la persona con discapacidad",29,23,6,0,8,1,7]
["S. M. A.",131,128,3,0,"s/d","s/d","s/d"]
["S.S.E.",24,9,15,0,"s/d","s/d","s/d"]
["S.Tp.E",99,95,4,0,"s/d","s/d","s/d"]
["Servicio de intendencia del Ejército",31,30,1,0,"s/d","s/d","s/d"]
["Servicio de veterinaria y remonta",82,31,51,0,"s/d","s/d","s/d"," "]
["Servicio geográfico militar 1",23,19,4,0,7,3,4]
["Servicio geográfico militar 2",24,19,5,0,"s/d","s/d","s/d"]
["PRIVADO TOTAL",73321,30712,42606,3,6866,2276,4590]
["4D Content English","s/d","s/d","s/d","s/d",20,6,14]
["Academia Alfa",136,52,84,0,25,6,19]
["Academia de Choferes ABACO",41,19,22,0,1,1,0]
["Academia de choferes LOMAS",896,394,502,0,12,12,0]
["Academia de choferes MARIO SILVA Y JOSÉ PIÑEIRO",60,24,36,0,1,1,0]
["Academia de choferes Mauricio Caro",217,168,49,0,12,12,0]
["Academia de Conductores Trébol",87,30,57,0,2,2,0]
["Academia de Música Nissi",178,92,86,0,12,6,6]
["Academia Del Molino","s/d","s/d","s/d","s/d",5,5,0]
["Academia Mario Rodriguez Contabilidades S.C.I.",39,13,26,0,5,0,5]
["Academia Pocitos","s/d","s/d","s/d","s/d",2,2,0]
["Academia Shopping","s/d","s/d","s/d","s/d",4,2,2]
["Accademia de choferes MONTEVIDEO","s/d","s/d","s/d","s/d",6,6,0]
["Access Institute",94,30,64,0,17,0,17]
["Acción Promocional 18 de Julio",452,228,224,0,11,5,6]
["ADISTAM",60,18,42,0,6,3,3]
["Aliança Brasileira",88,31,57,0,9,0,9]
["Alianza Artigas",85,37,48,0,3,0,3]
["Alianza Atlántida",126,49,77,0,21,6,15]
["Alianza Canelón Chico",76,27,49,0,13,0,13]
["Alianza Canelones",46,24,22,0,8,0,8]
["Alianza Colonia",354,151,203,0,45,4,41]
["Alianza Cultural San Ramón",176,77,99,0,20,0,20]
["Alianza Durazno",101,45,56,0,16,0,16]
["Alianza Migues",62,24,38,0,11,0,11]
["Alianza Minas",196,79,117,0,15,0,15]
["Alianza Pando",171,78,93,0,19,0,19]
["Alianza Paso de los Toros",57,25,32,0,14,4,10]
["Alianza Pocitos-Punta Carretas",860,341,519,0,82,19,63]
["Alianza Prado",241,110,131,0,34,3,31]
["Alianza Rivera",94,29,65,0,12,0,12]
["Alianza Rocha",85,24,61,0,14,0,14]
["Alianza Salto",78,40,38,0,17,0,17]
["Alianza Sayago - Paola Vilardo Duarte",95,29,66,0,20,0,20]
["Alianza Tala",127,65,62,0,13,0,13]
["Alois Tacuarembó S.R.L",70,2,68,0,9,3,6]
["American Language Institute - Malvín",28,15,13,0,9,0,9]
["American Language Institute - Young",53,19,34,0,14,0,14]
["ANETHOR S.A",737,707,30,0,8,8,0]
["Anglo Albo",163,66,97,0,27,2,25]
["Anglo Artigas",97,36,61,0,16,1,15]
["Anglo Atlántida",71,28,43,0,17,8,9]
["Anglo Cerro",196,87,109,0,28,4,24]
["Anglo de la Costa",304,128,176,0,30,1,29]
["Anglo La Blanqueada",250,117,133,0,40,2,38]
["Anglo La Teja",117,47,70,0,15,1,14]
["Anglo Las Piedras",143,50,93,0,8,0,8]
["Anglo Maldonado",329,126,203,0,11,0,11]
["Anglo Minas",34,17,17,0,6,0,6]
["Anglo Nueva Helvecia",44,26,18,0,1,0,1]
["Anglo Pando",125,44,81,0,17,0,17]
["Anglo Salinas",82,37,45,0,12,0,12]
["Anglo Unión",190,75,115,0,26,4,22]
["Anna Laura Payret",115,64,51,0,39,2,37]
["ARCHI - Mariela Suárez",168,150,18,0,2,1,1]
["ARQUITEMAS","s/d","s/d","s/d","s/d",7,7,0]
["AS.IM.SA",111,45,66,0,10,4,6]
["Asociación Civil Comunidad EMAUS Maldonado",100,47,53,0,8,3,5]
["Asociacion Civil El Abrojo",253,25,228,0,23,7,16]
["Asociación Civil El Abrojo - Casa Abierta",393,190,203,0,13,5,8]
["Asociación Civil Grupo Aportes",21,3,18,0,8,4,4]
["Asociación Civil Maestra Juana Guerra",267,163,104,0,9,2,7]
["Asociación Civil Solidaridad",55,15,40,0,25,9,16]
["Asociación Civil Sur","s/d","s/d","s/d","s/d",10,2,8]
["Asociación Cultural y Técnica",45,0,45,0,12,0,12]
["Asociación Cultural y Técnica - Del Plata",55,0,55,0,7,0,7]
["Asociación de ayuda integral al discapacitado rochense",175,105,70,0,7,2,5]
["Asociación de Diabéticos del Uruguay","s/d","s/d","s/d","s/d",8,4,4]
["Asociación para la educación económica Uruguay",62,29,33,0,69,32,37]
["Asociación Pro Recuperación del Inválido",103,60,43,0,7,2,5]
["Asociación Procardias",30,11,19,0,4,0,4]
["Atelier Rosario Viñoly",166,2,164,0,6,2,4]
["Audere SRL",58,6,52,0,7,0,7]
["Automóvil Club del Uruguay","s/d","s/d","s/d","s/d",15,15,0]
["AVC Capacitación",36,21,15,0,6,6,0]
["AyC Digital SRL",152,71,81,0,88,49,39]
["Bécassine SRL",22,4,18,0,5,0,5]
["Berlitz Uruguay SA","s/d","s/d","s/d","s/d",90,32,58]
["BIOS - Corporativo",791,228,563,0,35,9,26]
["BIOS - Escuela de Formación Técnico Laboral",906,380,526,0,64,37,27]
["BIOS - Escuela de Negocios y Administración",2034,705,1329,0,197,122,75]
["BIOS - Escuela de Sistemas y Tecnologías",1733,1436,297,0,51,38,13]
["BIOS - Lagomar",636,243,393,0,27,10,17]
["BIOS - Maldonado",312,146,166,0,36,24,12]
["BIOS - Prado",643,256,387,0,29,19,10]
["BIOS -Tres Cruces",934,429,505,0,13,9,4]
["Brasil Club SRL",93,37,56,0,8,5,3]
["Britannia Centre",150,67,83,0,26,0,26]
["British Institute",57,26,31,0,4,0,4]
["British Institute Tarariras",76,37,39,0,13,0,13]
["Business English, Inc","s/d","s/d","s/d","s/d",15,2,13]
["C.E.I.D.I  Nuestro Tiempo",446,260,186,0,18,6,12]
["Campanitas",139,86,53,0,4,0,4]
["CANCADI",110,72,38,0,10,2,8]
["Capítulo Montevideo Uruguay PMI",160,98,62,0,10,3,7]
["Casa de la Mujer de la Unión",167,11,156,0,65,7,58]
["CEAS",250,27,223,0,18,3,15]
["CEDERT",147,89,58,0,8,3,5]
["CEDU Corporación educativa del Uruguay",34,8,26,0,4,3,1]
["CEMEPSI",14,2,12,0,5,0,5]
["CENAFO SALUD",206,26,180,0,49,13,36]
["CENAFO SALUD  - Sistema nacional de cuidados",90,12,78,0,12,2,10]
["Centro Cooperativista Uruguayo",116,88,28,0,48,26,22]
["Centro Curva de Maroñas",229,141,88,0,9,0,9]
["Centro de atención neuropsicológica San José",232,155,77,0,19,4,15]
["Centro de Capacitación Jacksonville",394,153,241,0,9,9,0]
["Centro de Capacitación para la Salud - CE.CA.S",398,48,350,0,25,5,20]
["Centro de Capacitación Serrano",335,145,190,0,43,28,15]
["Centro de Capacitacion Técnica MG",127,5,122,0,8,1,7]
["Centro de Educación para la Salud",1653,241,1412,0,2,0,2]
["Centro de Educación Popular",77,3,74,0,18,2,16]
["Centro de estudios Yishel Battes",23,3,20,0,4,0,4]
["Centro de industriales panaderos del Uruguay",185,84,101,0,27,14,13]
["Centro de informaciones y estudios del Uruguay","s/d","s/d","s/d","s/d",10,6,4]
["Centro de inglés Pan de Azúcar",89,46,43,0,11,0,11]
["Centro de Integración Cultural Uruguay-China",66,27,39,0,11,0,11]
["Centro de investigación, desarrollo y comunicación de terapias magnéticas","s/d","s/d","s/d","s/d",2,0,2]
["Centro de investigaciones económicas","s/d","s/d","s/d","s/d",15,7,8]
["Centro de navegación",63,38,25,0,"s/d","s/d","s/d"]
["Centro de rehabilitación especial",141,92,49,0,11,4,7]
["Centro educativo para niños autistas",32,25,7,0,6,1,5]
["Centro Estudio","s/d","s/d","s/d","s/d",3,2,1]
["Centro estudios de inglés UU",63,35,28,0,18,0,18]
["Centro Ibira",127,71,56,0,17,0,17]
["Centro integral de enfermería Rivera",26,6,20,0,3,1,2]
["Centro integral de formación de enfermería (CIFE SRL)",95,18,77,0,7,1,6]
["Centro Juvenil \"4 vientos\"",96,50,46,0,11,5,6]
["Centro Libra",123,90,33,0,15,7,8]
["Centro Oeste Nuevo París",44,38,6,0,6,4,2]
["Centro pedagógico",60,39,21,0,7,0,7]
["Centro psicopedagógico de Pando",80,48,32,0,9,2,7]
["Centro uruguayo de gestión",42,9,33,0,3,1,2]
["CEPRIE",250,72,178,0,5,4,1]
["CEPRODIH",813,63,750,0,18,2,16]
["Chacra educativa Santa Lucía","s/d","s/d","s/d","s/d",7,2,5]
["CIAN",99,60,39,0,7,0,7]
["CIEDUR",280,65,215,0,120,33,87]
["CIEF","s/d","s/d","s/d","s/d",19,5,14]
["CITE. Centro de innovación en tecnologías, desarrollo empresarial y profesional.",19,6,13,0,19,5,14]
["CODOF",173,14,159,0,48,10,38]
["Colegio \"Creciendo juntos\" (Anexo)",111,63,48,0,8,1,7]
["Colegio \"Creciendo juntos\" (Principal)",44,22,22,0,5,1,4]
["Colegio de Contadores, Economistas y Adminsitradores del Uruguay",948,343,605,0,38,26,12]
["Colegio de enfermería Montevideo",59,5,54,0,35,0,35]
["Colegio San José",112,62,50,0,4,0,4]
["Comisión de padres pro hogar discapacitados intelectuales Melo",105,66,39,0,14,4,10]
["Comisión Escuela Especial",102,60,42,0,8,0,8]
["Comisión Honoraria para la Salud Cardiovascular - Ley 16626",42,8,34,0,2,0,2]
["Comunidad Israelita del Uruguay",51,37,14,0,7,0,7]
["Conservatorio musical Buchtik",121,47,74,0,80,26,54]
["Cooperativa de servicicos sociales (Mandalavos)",17,10,7,0,8,4,4]
["Cooperativa de servicios sociales (Planta de clasificación Durán)",330,187,143,0,12,3,9]
["Cooperativa Nuevo Horizonte",187,43,144,0,30,2,28]
["COTHAIN",81,42,39,0,6,0,6]
["Crown Institute",37,15,22,0,12,0,12]
["Cummins Maureen y Garcia Lucia SH","s/d","s/d","s/d","s/d",1,0,1]
["Desem Jóvenes Emprendedores",996,431,565,0,20,12,8]
["DESPERTARES Educación Integral",261,157,104,0,8,0,8]
["E.A.D.E.S.",90,10,80,0,28,2,26]
["E.EDU.PRO.MER. (Mercedes)",21,0,21,0,7,1,6]
["E.EDU.PRO.MER. Ltda.",128,18,110,0,20,2,18]
["EC English Courses",57,24,33,0,9,0,9]
["Educación Física Cooperativa (EFICO)","s/d","s/d","s/d","s/d",10,4,6]
["Educadora del Litoral",79,40,39,0,22,10,12]
["EIRE SRL",100,13,87,0,8,0,8]
["EIRE SRL (Atención a la dependencia)",4,0,4,0,6,0,6]
["El Abrojo - Carrasco Norte 1",22,7,15,0,8,1,7]
["El Abrojo - Carrasco Norte 2",22,8,14,0,8,1,7]
["El Abrojo - Carrasco Norte 3",27,12,15,0,7,2,5]
["El Abrojo - Carrasco Norte 4",24,3,21,0,7,3,4]
["El Abrojo - Casa Abierta",10,7,3,0,2,1,1]
["El Abrojo - Repique",81,39,42,0,1,1,0]
["El Abrojo - Trampolines",235,112,123,0,5,2,3]
["El Tejano",91,53,38,0,9,3,6]
["ELTEC",58,22,36,0,12,0,12]
["EMI EDUCA",141,79,62,0,9,1,8]
["EMICAR",38,14,24,0,5,3,2]
["EMOCIONARTE A.C",77,0,77,0,2,0,2]
["Empire English Center",55,26,29,0,16,2,14]
["ENCEVA",33,8,25,0,7,0,7]
["ENEDUR",198,21,177,0,21,0,21]
["ENFCELA SRL",188,27,161,0,9,1,8]
["English for kids",36,17,19,0,2,0,2]
["English Teaching Centre",105,41,64,0,17,0,17]
["Englishland",26,14,12,0,12,0,12]
["Englishtime",121,55,66,0,16,0,16]
["EPT Institute - Vidal Acosta Mirta Daniela",81,26,55,0,2,1,1]
["EQUITY Institute",104,43,61,0,15,0,15]
["Escuela \"La escena\"",66,18,48,0,4,3,1]
["Escuela Católica de Enfermería",186,32,154,0,21,4,17]
["Escuela Centro-sur",25,0,25,0,6,0,6]
["Escuela de Acción Artística Luis Trochón",342,37,305,0,48,9,39]
["Escuela de Ballet GYM-DANCE Studio",126,0,126,0,2,0,2]
["Escuela de choferes CHUFLES","s/d","s/d","s/d","s/d",5,5,0]
["Escuela de Diseño y Comunicación - Bios Bvar. España",1235,571,664,0,147,112,35]
["Escuela de Diseño y Comunicación - Bios Rivera",1304,1118,186,0,54,23,31]
["Escuela de Enfermería ANTARES",925,172,753,0,42,4,38]
["Escuela de Enfermería ARTE & CIENCIA",97,11,86,0,8,0,8]
["Escuela de Enfermería Asistencial Médica Departamental de Maldonado",93,14,79,0,22,3,19]
["Escuela de Enfermería COLÓN",83,0,83,0,9,2,7]
["Escuela de Enfermería Humanizar",145,22,123,0,9,2,7]
["Escuela de Enfermería IDECAS",616,112,504,0,35,6,29]
["Escuela de Enfermería Rivera",126,24,102,0,9,0,9]
["Escuela de Enfermería Rosario",146,9,137,0,25,0,25]
["Escuela de Enfermería y Formación en Salud Ltda",172,12,160,0,45,4,41]
["Escuela de Enfermería- CEHS",63,11,52,0,4,1,3]
["Escuela de Música Montevideo",205,102,103,0,12,10,2]
["Escuela del actor",115,40,75,0,6,3,3]
["Escuela Francesa de Negocios",86,38,48,0,29,15,14]
["Escuela Laura Llanes",34,20,14,0,8,4,4]
["Escuela Ma-pa",325,60,265,0,55,22,33]
["Escuela Ma-pa 2",2463,1661,802,0,91,66,25]
["Escuela Ma-pa 3",117,59,58,0,13,9,4]
["Escuela Nacional de Enfermería - ENE",2111,323,1788,0,54,10,44]
["Escuela Nacional de Enfermería de Lavalleja",144,6,138,0,12,0,12]
["Escuela Nacional de Enfermería de Treinta y Tres",243,29,214,0,19,0,19]
["Escuela Nacional de Operaciones de Paz del Uruguay",375,308,67,0,11,5,6]
["Escuela Paysandú de Auxiliares de Enfermería",166,33,133,0,9,1,8]
["Escuela Sarandí de Enfermería",7,2,5,0,3,0,3]
["Escuela Uruguaya de Técnica Alexander",16,4,12,0,2,0,2]
["Espacio Click",18,12,6,0,2,1,1]
["Espacio cultural y educativo \"La casa de las letras\"",42,9,33,0,9,3,6]
["Essential English Institute",171,73,98,0,7,0,7]
["Estudio MU-DANZA","s/d","s/d","s/d","s/d",2,1,1]
["Estudio Uno Pilates","s/d","s/d","s/d","s/d",8,0,8]
["ETTI",22,4,18,0,4,3,1]
["ETUM",115,68,47,0,2,2,0]
["FIGHTER SRL",147,123,24,0,1,1,0]
["Florida Ballet Estudio",70,1,69,0,2,0,2]
["Fundación A Ganar",551,303,248,0,15,6,9]
["Fundación Astur",92,5,87,0,9,2,7]
["Fundación de integración socioeducativa (FISE)",384,123,261,0,37,14,23]
["Fundación La Muralla",50,30,20,0,3,2,1]
["Fundación Mentalis",82,59,23,0,8,4,4]
["Fundación para el Apoyo a la Facultad de CCEEyA",877,274,603,0,77,44,33]
["Gato Dumas Colegio de Gastronomía",599,289,310,0,74,40,34]
["Graciela Margarita Mattos Pizzo 1",11,0,11,0,4,0,4]
["Graciela Margarita Mattos Pizzo 2",11,0,11,0,4,1,3]
["Graciela Pagano y Rodrigo Garmendia","s/d","s/d","s/d","s/d",5,1,4]
["Grameen Uruguay",141,43,98,0,24,14,10]
["GROOVE",249,83,166,0,13,8,5]
["Grupo Sinergias",19,14,5,0,5,2,3]
["Gurises Unidos",21,6,15,0,2,1,1]
["Gustavo Perdomo","s/d","s/d","s/d","s/d",2,2,0]
["High Flyers",58,25,33,0,3,0,3]
["Highlands School",64,36,28,0,12,0,12]
["Highlands School Artigas",64,31,33,0,7,0,7]
["Highlands School Mercedes",55,18,37,0,9,0,9]
["Homoludens",10,1,9,0,8,3,5]
["Huertas Abrojo",20,5,15,0,4,0,4]
["I.E.T.I",210,97,113,0,4,0,4]
["IADE",197,22,175,0,9,1,8]
["ICAU (Anglo)",74,41,33,0,12,1,11]
["IDE Institute",51,25,26,0,4,1,3]
["Idea Innovación y Desarrollo para la Autogestión",20,0,20,0,1,0,1]
["IDEAS",1321,848,473,0,33,29,4]
["IDEI",75,37,38,0,12,0,12]
["IFOSS",35,0,35,0,3,0,3]
["Iliana Cedrés Bonilla",89,37,52,0,14,0,14]
["INADI - Instituto Nacional de Informática",153,78,75,0,9,6,3]
["INC English Services",79,41,38,0,14,4,10]
["INFOCE",88,26,62,0,12,6,6]
["Inglés Silver",50,19,31,0,2,0,2]
["Instituto Accent English Language Courses",116,32,84,0,17,0,17]
["Instituto Anglo Malvín",58,17,41,0,18,0,18]
["Instituto Anglo Uruguayo",195,96,99,0,25,0,25]
["Instituto BEC Ltda.",178,86,92,0,29,15,14]
["Instituto Brighton",177,74,103,0,14,0,14]
["Instituto CATEL",218,46,172,0,7,2,5]
["Instituto CEFOR",50,0,50,0,6,2,4]
["Instituto CPE",1869,763,1106,0,78,43,35]
["Instituto Cultural Anglo Uruguayo - Mercedes",148,69,79,0,13,0,13]
["Instituto Cultural Anglo Uruguayo - Paysandu",244,103,141,0,38,7,31]
["Instituto Cultural Anglo Uruguayo de Rivera",405,171,234,0,41,0,41]
["Instituto Cultural Anglo-Uruguayo de Salto (Midland)",153,74,79,0,15,3,12]
["Instituto Cultural Anglo-Uruguayo de Salto (Town)",430,187,242,1,51,10,41]
["Instituto Cultural Gaboto",171,3,168,0,21,5,16]
["Instituto danza clásica Tania Sanner",26,0,26,0,1,0,1]
["Instituto de aprendizaje y psicopedagogía",47,29,18,0,4,0,4]
["Instituto de capacitación laboral (Rodríguez Leites Lisiani)",22,2,20,0,2,0,2]
["Instituto de capacitación profesional - ICP Centro",16,1,15,0,3,3,0]
["Instituto de coaching en salud, nutrición y deporte",152,32,120,0,11,1,10]
["Instituto de comunicación y desarrollo (ICD)",16,8,8,0,2,0,2]
["Instituto de cultura inglesa",794,404,390,0,48,3,45]
["Instituto de cultura uruguayo brasileño",565,184,381,0,41,9,32]
["Instituto de danzas Verónica Samurio",289,14,275,0,12,0,12]
["Instituto de educación centro DEI",84,19,65,0,3,3,0]
["Instituto de enseñanza LC",220,77,143,0,41,17,24]
["Instituto de formación técnico deportivo Dreams",96,64,32,0,20,13,7]
["Instituto de idiomas, inglés y alemán - Virginia López Farinasso",60,34,26,0,11,0,11]
["Instituto de Ingles Cedi",105,41,64,0,15,0,15]
["Instituto de inglés Melo",90,42,48,0,12,0,12]
["Instituto de inglés Prof. Carmen Cabo",47,21,26,0,3,0,3]
["Instituto de restauración y conservación de bienes culturales",34,4,30,0,2,1,1]
["Instituto de Yoga Carrasco",71,11,60,0,9,2,7]
["Instituto GANEM",109,27,82,0,7,4,3]
["Instituto I.E.CO.",100,38,62,0,15,6,9]
["Instituto IMF 1",21,9,12,0,1,0,1]
["Instituto IMF 2",25,10,15,0,1,0,1]
["Instituto Marlowe",61,23,38,0,23,0,23]
["Instituto Massey",11,2,9,0,3,0,3]
["Instituto Michigan",10,5,5,0,18,2,16]
["Instituto Mundo Nuevo",198,37,161,0,20,6,14]
["Instituto Prado",63,23,40,0,4,0,4]
["Instituto técnico hotelero gastronómico del Uruguay",174,93,81,0,21,15,6]
["Instituto tecnológico del Uruguay LTDA",246,59,187,0,18,4,14]
["Instituto Tercer Milenio",127,29,98,0,18,9,9]
["Instituto uruguayo de Auditoría Interna",130,40,90,0,21,11,10]
["Instituto uruguayo de normas técnicas",5318,2501,2817,0,393,248,145]
["IPSSO",61,17,44,0,6,0,6]
["IUDEL",518,234,282,2,32,12,20]
["Jiàn Dào Escuela de Disciplinas Orientales",61,12,49,0,8,5,3]
["Jose Lanzavecchia","s/d","s/d","s/d","s/d",8,2,6]
["KENT Institute",130,55,75,0,27,5,22]
["Kingston Language Centre",40,9,31,0,12,0,12]
["La Casona del Sur - ELT",85,40,45,0,23,8,15]
["Learning English Minas",15,6,9,0,7,0,7]
["LURAMA",22,0,22,0,5,0,5]
["Managerial","s/d","s/d","s/d","s/d",13,12,1]
["Mariela González",6,3,3,0,4,0,4]
["Misión Vida para las Naciones",447,188,259,0,9,5,4]
["Movimiento de la Juventud Agraria",156,81,75,0,3,1,2]
["MSH Capacitación - Instituto de la Cra. Monica Sanjuan","s/d","s/d","s/d","s/d",6,0,6]
["Mundo Informático",244,72,172,0,33,4,29]
["Musiescuela",63,27,36,0,6,2,4]
["Netwide",170,107,63,0,12,3,9]
["Objetivo Centro de Estudios",156,87,69,0,23,7,16]
["Oxbridge Institute","s/d","s/d","s/d","s/d",51,19,32]
["Perez y Pons SRL",49,25,24,0,4,4,0]
["Personal Pilates",200,16,184,0,7,3,4]
["PMA","s/d","s/d","s/d","s/d",5,1,4]
["Profesionales Asociados SRL",142,6,136,0,10,6,4]
["Profesor autorizado Anglo Yesica Belveder",97,36,61,0,8,0,8]
["Profesor de inglés Javier Vidal",33,15,18,0,9,9,0]
["Programa CARDIJN",103,48,55,0,32,16,16]
["Programa de educación audiovisual y lenguaje cinematográfico (PEALC)",100,48,52,0,2,2,0]
["PROSALUD Florida",205,33,172,0,35,8,27]
["Proyecto Trabajo",180,39,141,0,71,40,31]
["Punto Pilates - Sofía Kramer",60,1,59,0,7,0,7]
["Qualitas Fray Bentos (Estela Rosmari Benitez Ortiz)",832,718,114,0,12,9,3]
["Querer la vida",142,58,84,0,7,2,5]
["Red Qualitas - Miguel Ángel Morello Centanaro",86,34,52,0,4,3,1]
["Red Qualitas Treinta y Tres",71,29,42,0,3,2,1]
["RedQUALITAS Tarariras",69,36,33,0,9,5,4]
["Regiluz SA",724,329,395,0,32,18,14]
["Sadhana Escuela de Desarrollo Personal 1","s/d","s/d","s/d","s/d",5,3,2]
["Sadhana Escuela de Desarrollo Personal 2","s/d","s/d","s/d","s/d",6,4,2]
["Saint Mary's English School",52,26,26,0,11,0,11]
["Samir Safadi Reid","s/d","s/d","s/d","s/d",234,28,206]
["Schnyder Quesada Justa María","s/d","s/d","s/d","s/d",13,0,13]
["SERINF",470,121,349,0,110,33,77]
["Sinergia Campus SRL",77,34,43,0,8,4,4]
["Somerset House English",40,21,19,0,9,5,4]
["Success",52,18,34,0,8,2,6]
["TAITA",108,67,41,0,37,13,24]
["Taller para las Artes - Raquel Sánchez",83,23,60,0,4,1,3]
["Taller Uruguayo de Música Popular","s/d","s/d","s/d","s/d",29,18,11]
["Tao Club Asociación Civil","s/d","s/d","s/d","s/d",13,6,7]
["TAPAC",121,59,62,0,6,2,4]
["Thai Massage School - Virginia Vitale",301,61,240,0,7,0,7]
["The British House",19,4,15,0,1,0,1]
["THIRDI",122,57,65,0,10,3,7]
["TODOARTE Uruguay",700,378,322,0,24,14,10]
["United Kingdom Institute - Anexo 25 de Mayo",30,12,18,0,7,0,7]
["United Kingdom Institute - Anexo Gutierrez Ruiz",4,2,2,0,4,0,4]
["United Kingdom Institute - Anexo Rincón",56,16,40,0,9,0,9]
["Villa Regina SRL",109,15,94,0,7,0,7]
["Voices 1","s/d","s/d","s/d","s/d",13,0,13]
["Voices 2",97,44,53,0,13,0,13]
[]
[]
["Fuente: Elaboración propia en base a la información del Relevamiento de Instituciones de oferta de formación en Educación No Formal. Realizado por la División de Investigación y Estadística."]

{"sheet":"II-8.4.2","index":110,"n_rows":126,"n_cols":15,"rows_kept":126,"cut":false,"hidden":false,"merged":[[9,6,9,8],[9,10,9,12],[0,6,1,12],[4,0,4,4],[5,0,5,4],[6,0,6,8],[8,0,9,0],[8,1,9,1],[8,2,8,4],[8,6,8,8],[8,10,8,12],[9,2,9,4]]}
["MEC"]
["División de Investigación y Estadística"]
[]
[]
[]
["Cuadro II 8.4.2"]
["INGRESADOS, MATRÍCULA  Y EGRESADOS DEL RELEVAMIENTO DE INSTITUCIONES DE OFERTA DE FORMACIÓN EN EDUCACIÓN NO FORMAL SEGÚN REGIÓN Y ÁREAS DE CONOCIMIENTO. (Todo el país, 2017)"]
[]
["REGIÓN/ÁREAS DE CONOCIMENTO","TOTAL","INGRESO",null,null,null,"MATRÍCULA",null,null,null,"EGRESO"]
[null,null,"SEXO",null,null,"TOTAL","SEXO",null,null,"TOTAL","SEXO"]
[null,null,"M","F","SD",null,"M","F","SD",null,"M","F","SD"]
["MONTEVIDEO",55747,24907,30837,3,58433,26000,32430,3,32000,15050,16948,2]
["AGRICULTURA",59,36,23,0,59,36,23,0,40,20,20,0]
["ALFABETIZACIÓN Y ARITMÉTICA",74,38,36,0,74,38,36,0,40,20,20,0]
["ARQUITECTURA Y CONSTRUCCIÓN",480,383,97,0,490,387,103,0,297,279,18,0]
["ARTES",3045,1320,1725,0,3482,1472,2010,0,761,339,422,0]
["BIENESTAR",1070,105,965,0,1074,105,969,0,713,70,643,0]
["CIENCIAS BIOLÓGICAS Y AFINES",69,23,46,0,69,23,46,0,36,12,24,0]
["CIENCIAS SOCIALES Y DEL COMPORTAMIENTO",369,103,266,0,387,106,281,0,293,85,208,0]
["COMPETENCIAS PERSONALES Y DESARROLLO",779,225,553,1,784,229,554,1,510,75,434,1]
["DERECHO",240,120,120,0,240,120,120,0,206,100,106,0]
["EDUCACIÓN",812,138,674,0,1117,156,961,0,727,67,660,0]
["EDUCACIÓN COMERCIAL Y ADMINISTRACIÓN",13079,5760,7318,1,13368,5915,7452,1,6672,2800,3871,1]
["HUMANIDADES",447,170,277,0,447,170,277,0,5,0,5,0]
["IDIOMAS",5649,2379,3270,0,5769,2430,3339,0,4648,1952,2696,0]
["INDUSTRIA Y PRODUCCIÓN",1576,591,985,0,1627,619,1008,0,1144,421,723,0]
["INGENIERÍA Y PROFESIONES AFINES",1457,1295,162,0,1457,1295,162,0,861,822,39,0]
["MATEMÁTICAS Y ESTADÍSTICA",240,114,126,0,240,114,126,0,202,100,102,0]
["OTROS",1858,921,937,0,1889,932,957,0,1458,722,736,0]
["PERIODISMO E INFORMACIÓN",40,22,18,0,41,22,19,0,12,5,7,0]
["PROGRAMAS Y CERTIFICACIONES BÁSICOS",424,238,186,0,527,299,228,0,10,3,7,0]
["SALUD",6928,1259,5669,0,7162,1294,5868,0,1759,363,1396,0]
["SERVICIOS DE HIGIENE Y SALUD OCUPACIONAL",1254,631,623,0,1254,631,623,0,1032,506,526,0]
["SERVICIOS DE SEGURIDAD",4564,3428,1135,1,4701,3542,1158,1,4304,3247,1057,0]
["SERVICIOS DE TRANSPORTE",710,538,172,0,710,538,172,0,565,450,115,0]
["SERVICIOS PERSONALES",4030,1434,2596,0,4129,1468,2661,0,2495,691,1804,0]
["SILVICULTURA",20,19,1,0,20,19,1,0,17,16,1,0]
["TECNOLOGÍAS DE LA INFORMACIÓN Y LA COMUNICACIÓN",6448,3607,2841,0,7290,4030,3260,0,3173,1878,1295,0]
["VETERINARIA",26,10,16,0,26,10,16,0,20,7,13,0]
["REGIÓN SUR",10464,4856,5608,0,11118,5164,5954,0,7178,3447,3731,0]
["AGRICULTURA",38,4,34,0,64,28,36,0,38,4,34,0]
["ALFABETIZACIÓN Y ARITMÉTICA",19,13,6,0,19,13,6,0,19,13,6,0]
["ARQUITECTURA Y CONSTRUCCIÓN",68,68,0,0,68,68,0,0,68,68,0,0]
["ARTES",262,136,126,0,357,192,165,0,148,76,72,0]
["BIENESTAR",147,20,127,0,147,20,127,0,115,2,113,0]
["COMPETENCIAS PERSONALES Y DESARROLLO",65,17,48,0,65,17,48,0,62,16,46,0]
["EDUCACIÓN",147,16,131,0,147,16,131,0,130,9,121,0]
["EDUCACIÓN COMERCIAL Y ADMINISTRACIÓN",685,152,533,0,746,171,575,0,346,72,274,0]
["IDIOMAS",3565,1495,2070,0,3688,1552,2136,0,2806,1184,1622,0]
["INDUSTRIA Y PRODUCCIÓN",124,71,53,0,147,81,66,0,89,60,29,0]
["INGENIERÍA Y PROFESIONES AFINES",225,215,10,0,225,215,10,0,213,203,10,0]
["OTROS",549,313,236,0,583,334,249,0,249,121,128,0]
["PROGRAMAS Y CERTIFICACIONES BÁSICOS",339,201,138,0,355,210,145,0,304,179,125,0]
["SALUD",1025,185,840,0,1163,213,950,0,457,79,378,0]
["SERVICIOS DE HIGIENE Y SALUD OCUPACIONAL",42,19,23,0,61,28,33,0,19,3,16,0]
["SERVICIOS DE SEGURIDAD",564,515,49,0,564,515,49,0,461,413,48,0]
["SERVICIOS DE TRANSPORTE",1281,712,569,0,1281,712,569,0,950,582,368,0]
["SERVICIOS PERSONALES",491,275,216,0,571,323,248,0,316,169,147,0]
["TECNOLOGÍAS DE LA INFORMACIÓN Y LA COMUNICACIÓN",758,407,351,0,797,434,363,0,320,172,148,0]
["VETERINARIA",70,22,48,0,70,22,48,0,68,22,46,0]
["REGIÓN ESTE",2143,853,1290,0,2257,911,1346,0,1289,566,723,0]
["AGRICULTURA",8,8,0,0,8,8,0,0,8,8,0,0]
["ARTES",161,86,75,0,177,89,88,0,59,19,40,0]
["BIENESTAR",50,0,50,0,50,0,50,0,4,0,4,0]
["CIENCIAS SOCIALES Y DEL COMPORTAMIENTO",20,19,1,0,20,19,1,0,20,19,1,0]
["COMPETENCIAS PERSONALES Y DESARROLLO",53,33,20,0,53,33,20,0,43,27,16,0]
["DERECHO",34,21,13,0,34,21,13,0,34,21,13,0]
["EDUCACIÓN",2,0,2,0,2,0,2,0,2,0,2,0]
["EDUCACIÓN COMERCIAL Y ADMINISTRACIÓN",86,26,60,0,86,26,60,0,53,19,34,0]
["IDIOMAS",522,203,319,0,560,219,341,0,347,137,210,0]
["INDUSTRIA Y PRODUCCIÓN",58,42,16,0,58,42,16,0,58,42,16,0]
["INGENIERÍA Y PROFESIONES AFINES",67,66,1,0,67,66,1,0,65,64,1,0]
["PROGRAMAS Y CERTIFICACIONES BÁSICOS",175,96,79,0,235,135,100,0,117,64,53,0]
["SALUD",441,48,393,0,441,48,393,0,162,13,149,0]
["SERVICIOS PERSONALES",290,97,193,0,290,97,193,0,204,62,142,0]
["TECNOLOGÍAS DE LA INFORMACIÓN Y LA COMUNICACIÓN",176,108,68,0,176,108,68,0,113,71,42,0]
["REGIÓN CENTRAL",1444,452,992,0,1658,538,1120,0,1202,406,796,0]
["ARQUITECTURA Y CONSTRUCCIÓN",80,63,17,0,80,63,17,0,80,63,17,0]
["ARTES",100,10,90,0,100,10,90,0,100,10,90,0]
["BIENESTAR",70,2,68,0,70,2,68,0,70,2,68,0]
["EDUCACIÓN COMERCIAL Y ADMINISTRACIÓN",84,20,64,0,84,20,64,0,84,20,64,0]
["HUMANIDADES",10,3,7,0,10,3,7,0,10,3,7,0]
["IDIOMAS",423,199,224,0,545,253,292,0,468,210,258,0]
["INDUSTRIA Y PRODUCCIÓN",80,28,52,0,80,28,52,0,20,4,16,0]
["PROGRAMAS Y CERTIFICACIONES BÁSICOS",17,8,9,0,57,32,25,0,12,4,8,0]
["SALUD",441,56,385,0,493,64,429,0,219,27,192,0]
["SERVICIOS DE HIGIENE Y SALUD OCUPACIONAL",19,11,8,0,19,11,8,0,19,11,8,0]
["SERVICIOS DE TRANSPORTE",50,46,4,0,50,46,4,0,50,46,4,0]
["SERVICIOS PERSONALES",70,6,64,0,70,6,64,0,70,6,64,0]
["REGIÓN LITORAL",3895,1849,2045,1,4344,1913,2430,1,2757,1358,1399,0]
["AGRICULTURA",111,30,81,0,111,30,81,0,105,27,78,0," "]
["ARTES",114,17,97,0,316,22,294,0,38,16,22,0]
["BIENESTAR",65,0,65,0,207,6,201,0,158,2,156,0]
["CIENCIAS BIOLÓGICAS Y AFINES",22,16,6,0,22,16,6,0,17,14,3,0]
["COMPETENCIAS PERSONALES Y DESARROLLO",53,9,44,0,53,9,44,0,49,9,40,0]
["EDUCACIÓN",106,2,104,0,136,25,111,0,95,11,84,0]
["EDUCACIÓN COMERCIAL Y ADMINISTRACIÓN",118,36,82,0,136,43,93,0,85,25,60,0]
["IDIOMAS",1483,642,840,1,1483,642,840,1,814,352,462,0]
["INDUSTRIA Y PRODUCCIÓN",114,25,89,0,114,25,89,0,91,23,68,0]
["INGENIERÍA Y PROFESIONES AFINES",51,38,13,0,51,38,13,0,27,18,9,0]
["OTROS",179,92,87,0,179,92,87,0,158,86,72,0,null," "]
["PERIODISMO E INFORMACIÓN",7,6,1,0,7,6,1,0,7,6,1,0]
["PROGRAMAS Y CERTIFICACIONES BÁSICOS",139,86,53,0,139,86,53,0,0,0,0,0]
["SALUD",246,44,202,0,291,56,235,0,164,30,134,0]
["SERVICIOS DE HIGIENE Y SALUD OCUPACIONAL",630,605,25,0,630,605,25,0,630,605,25,0]
["SERVICIOS PERSONALES",162,50,112,0,162,50,112,0,104,26,78,0]
["TECNOLOGÍAS DE LA INFORMACIÓN Y LA COMUNICACIÓN",295,151,144,0,307,162,145,0,215,108,107,0]
["REGIÓN NORTE",2280,790,1490,0,2416,814,1602,0,1765,662,1103,0]
["AGRICULTURA",26,12,14,0,26,12,14,0,0,0,0,0]
["ARTES",50,12,38,0,50,12,38,0,0,0,0,0]
["BIENESTAR",50,0,50,0,50,0,50,0,47,0,47,0]
["EDUCACIÓN COMERCIAL Y ADMINISTRACIÓN",93,18,75,0,110,24,86,0,87,22,65,0]
["IDIOMAS",1238,538,700,0,1240,539,701,0,1200,520,680,0]
["INDUSTRIA Y PRODUCCIÓN",37,22,15,0,37,22,15,0,0,0,0,0]
["OTROS",74,44,30,0,74,44,30,0,74,44,30,0]
["PROGRAMAS Y CERTIFICACIONES BÁSICOS",31,22,9,0,31,22,9,0,31,22,9,0]
["SALUD",568,85,483,0,685,102,583,0,248,30,218,0]
["SERVICIOS PERSONALES",15,2,13,0,15,2,13,0,0,0,0,0]
["TECNOLOGÍAS DE LA INFORMACIÓN Y LA COMUNICACIÓN",98,35,63,0,98,35,63,0,78,24,54,0]
[]
["Fuente: Elaboración propia en base a la información del Relevamiento de Instituciones de oferta de formación en Educación No Formal.  Realizado por la División de Investigación y Estadística."]
["Nota: Región Sur: Canelones, Colonia, Maldonado y San José"]
["Región Este: Lavalleja, Rocha y Treinta y Tres"]
["Región Central: Durazno, Florida y Tacuarembó"]
["Región Litoral: Flores, Paysandú, Río Negro, Salto y Soriano"]
["Región Norte: Artigas, Cerro Largo y Rivera"]

{"sheet":"CONTROL","index":111,"n_rows":10,"n_cols":4,"rows_kept":10,"cut":false,"hidden":true,"merged":[]}
[null,"PRIMER CUADRO","SEGUNDO CUADRO"]
["MATRÍCULA","II-1.2.1","II-1.2.2",{"$f":"IF(#REF!, \"OK\", \"INCONSISTENCIA\")","v":{"$error":"#REF!"}}]
["MATRÍCULA","II-1.2.1","II-1.2.3",{"$f":"IF(#REF!=#REF!, \"OK\", \"INCONSISTENCIA\")","v":{"$error":"#REF!"}}]
["MATRÍCULA","II-1.2.1","II-1.2.5",{"$f":"IF(#REF!=#REF!, \"OK\", \"INCONSISTENCIA\")","v":{"$error":"#REF!"}}]
["MATRÍCULA","II-1.2.1","II-1.2.6",{"$f":"IF(#REF!=#REF!,\"OK\",\"INCONSISTENCIA\")","v":{"$error":"#REF!"}}]
["MATRÍCULA","II-1.2.4","II-1.2.5",{"$f":"IF(#REF!, \"OK\", \"INCONSISTENCIA\")","v":{"$error":"#REF!"}}]
["MATRÍCULA","II-1.2.4","II-1.2.6",{"$f":"IF(#REF!=#REF!, \"OK\", \"INCONSISTENCIA\")","v":{"$error":"#REF!"}}]
["MATRÍCULA","II-1.2.5","II-1.2.6",{"$f":"IF(#REF!=#REF!,\"OK\",\"INCONSISTENCIA\")","v":{"$error":"#REF!"}}]
["MATRÍCULA","II-1.2.5","II-1.2.7",{"$f":"IF(#REF! =#REF!, \"OK\", \"INCONSISTENCIA\")","v":{"$error":"#REF!"}}]
["PERSONAL","II-1.3.3","II-1.3.4",{"$f":"IF(#REF! =#REF!, \"OK\", \"INCONSISTENCIA\")","v":{"$error":"#REF!"}}]

{"sheet":"CONTROL ","index":112,"n_rows":23,"n_cols":11,"rows_kept":23,"cut":false,"hidden":true,"merged":[[0,0,0,5],[0,6,0,9]]}
["DENTRO DE PRIMARIA",null,null,null,null,null,"EN SINOPSIS"]
[null,"PRIMER CUADRO","SEGUNDO CUADRO","TERCER CUADRO",null,"Aclaración. ","PRIMER CUADRO","SEGUNDO CUADRO","TERCER CUADRO"]
["ESTABLEC.","II-2.1.1"," II-2.1.2 ",null,{"$f":"IF(SUM(#REF!+#REF!+#REF!+#REF!+#REF! +#REF! =#REF!),\"OK\",\"INCONSISTENCIA\")","v":{"$error":"#REF!"}}]
["ESTABLEC.","II-2.1.1","II-2.1.4",null,{"$f":"IF(#REF!=#REF!,\"OK\",\"INCONSISTENCIA\")","v":{"$error":"#REF!"}}]
["ESTABLEC.","II-2.1.1","II-2.1.4",null,{"$f":"IF(#REF!=#REF!,\"OK\",\"INCONSISTENCIA\")","v":{"$error":"#REF!"}},{"$f":"IF(E5=\"INCONSISTENCIA\",\"Número de establecimiento de especial\",\"\")","v":{"$error":"#REF!"}}]
["MATRÍCULA","II-2.2.1","II-2.2.2",null,{"$f":"IF(#REF!=#REF!,\"OK\",\"INCONSISTENCIA\")","v":{"$error":"#REF!"}},{"$f":"IF(E6=\"INCONSISTENCIA\",\"Matrícula de Primaria Pública\",\"\")","v":{"$error":"#REF!"}},null,null,null,{"$f":"IF((#REF!+#REF!)=#REF!,\"OK\",\"INCONSISTENCIA\")","v":{"$error":"#REF!"}},{"$f":"IF(J6=\"INCONSISTENCIA\",\"Matrícula de Primaria Pública\",\"\")","v":{"$error":"#REF!"}}]
["MATRÍCULA","II-2.2.2","II-2.2.3",null,{"$f":"IF(#REF!=SUM(#REF!-#REF!),\"OK\",\"INCONSISTENCIA\")","v":{"$error":"#REF!"}},null,null,null,null,{"$f":"IF((#REF!+#REF!)=#REF!,\"OK\",\"INCONSISTENCIA\")","v":{"$error":"#REF!"}}]
["MATRÍCULA","II-2.2.2","II-2.2.8",null,{"$f":"IF(#REF!=#REF!,\"OK\",\"INCONSISTENCIA\")","v":{"$error":"#REF!"}}]
["MATRÍCULA","II-2.2.1","II-2.2.6",null,{"$f":"IF(#REF!=#REF!,\"OK\",\"INCONSISTENCIA\")","v":{"$error":"#REF!"}}]
["MATRÍCULA","II-2.2.2","II-2.2.8",null,{"$f":"IF(#REF!=#REF!,\"OK\",\"INCONSISTENCIA\")","v":{"$error":"#REF!"}}]
["MATRÍCULA","II-2.2.1","II-2.2.8",null,{"$f":"IF(#REF!=#REF!,\"OK\",\"INCONSISTENCIA\")","v":{"$error":"#REF!"}}]
["MATRÍCULA","II-2.2.2","II-2.2.9",null,{"$f":"IF(#REF!=#REF!,\"OK\",\"INCONSISTENCIA\")","v":{"$error":"#REF!"}}]
["MATRÍCULA","II-2.2.1","II-2.2.10",null,{"$f":"IF(#REF!=#REF!,\"OK\",\"INCONSISTENCIA\")","v":{"$error":"#REF!"}}]
["MATRÍCULA","II-2.2.2","II-2.2.11",null,{"$f":"IF(#REF!=#REF!,\"OK\",\"INCONSISTENCIA\")","v":{"$error":"#REF!"}}]
["MATRÍCULA","II-2.2.1","II-2.2.11",null,{"$f":"IF(#REF!=#REF!,\"OK\",\"INCONSISTENCIA\")","v":{"$error":"#REF!"}}]
["MATRÍCULA","II-2.2.12","II-2.2.13",null,{"$f":"IF(#REF!=#REF!,\"OK\",\"INCONSISTENCIA\")","v":{"$error":"#REF!"}}]
["MATRÍCULA","II-2.2.10","II-2.2.12",null,{"$f":"IF(#REF!=#REF!,\"OK\",\"INCONSISTENCIA\")","v":{"$error":"#REF!"}}]
["MATRÍCULA","II-2.2.12","II-2.2.13",null,{"$f":"IF(#REF!=#REF!,\"OK\",\"INCONSISTENCIA\")","v":{"$error":"#REF!"}}]
["MATRÍCULA","II-2.2.13","II-2.2.14",null,{"$f":"IF(#REF!=#REF!,\"OK\",\"INCONSISTENCIA\")","v":{"$error":"#REF!"}}]
["MATRÍCULA","II-2.2.13","II-2.2.14",null,{"$f":"IF(#REF!=#REF!,\"OK\",\"INCONSISTENCIA\")","v":{"$error":"#REF!"}}]
["MATRÍCULA","II-2.2.1","II-2.2.15",null,{"$f":"IF(#REF!=#REF!+#REF!,\"OK\",\"INCONSISTENCIA\")","v":{"$error":"#REF!"}}]
["MATRÍCULA","II-2.2.16","II-2.2.17",null,{"$f":"IF(#REF!=#REF!,\"OK\",\"INCONSISTENCIA\")","v":{"$error":"#REF!"}}]
["MATRÍCULA","II-2.2.1","II-2.2.18",null,{"$f":"IF(#REF!=#REF!,\"OK\",\"INCONSISTENCIA\")","v":{"$error":"#REF!"}}]

{"sheet":"CONTROL Media Básica","index":113,"n_rows":15,"n_cols":4,"rows_kept":15,"cut":false,"hidden":true,"merged":[]}
[null,"PRIMER CUADRO","SEGUNDO CUADRO"]
["MATRÍCULA","II-3.2.1","II-3.2.4",{"$f":"IF(#REF! =#REF!, \"OK\", \"INCONSISTENCIA\")","v":{"$error":"#REF!"}}]
["MATRÍCULA","II-3.2.1","II-3.2.4",{"$f":"IF(#REF! =#REF!, \"OK\", \"INCONSISTENCIA\")","v":{"$error":"#REF!"}}]
["MATRÍCULA","II-3.2.1","II-3.2.4",{"$f":"IF(#REF! =#REF!, \"OK\", \"INCONSISTENCIA\")","v":{"$error":"#REF!"}}]
["MATRÍCULA","II-3.2.1","II-3.2.4",{"$f":"IF(#REF! =#REF!, \"OK\", \"INCONSISTENCIA\")","v":{"$error":"#REF!"}}]
["MATRÍCULA","II-3.2.1","II-3.2.4",{"$f":"IF(#REF! =#REF!, \"OK\", \"INCONSISTENCIA\")","v":{"$error":"#REF!"}}]
["MATRÍCULA","II-3.2.1","II-3.2.4",{"$f":"IF(#REF! =#REF!, \"OK\", \"INCONSISTENCIA\")","v":{"$error":"#REF!"}}]
["MATRÍCULA","II-3.2.2","II-3.2.5",{"$f":"IF('[1]II-3.2.2'!C14='II-3.2.7'!F9, \"OK\", \"INCONSISTENCIA\")","v":"INCONSISTENCIA"}]
["MATRÍCULA","II-3.2.2","II-3.2.5",{"$f":"IF('[1]II-3.2.2'!F14='II-3.2.7'!C9, \"OK\", \"INCONSISTENCIA\")","v":"INCONSISTENCIA"}]
["MATRÍCULA","II-3.2.2","II-3.2.5",{"$f":"IF('[1]II-3.2.2'!I14='II-3.2.7'!D9, \"OK\", \"INCONSISTENCIA\")","v":"INCONSISTENCIA"}]
["MATRÍCULA","II-3.2.2","II-3.2.5",{"$f":"IF('[1]II-3.2.2'!L14='II-3.2.7'!E9, \"OK\", \"INCONSISTENCIA\")","v":"INCONSISTENCIA"}]
["MATRÍCULA","II-3.2.5","II-3.2.6",{"$f":"IF('II-3.2.7'!C9='II-3.2.8 '!E10, \"OK\", \"INCONSISTENCIA\")","v":"INCONSISTENCIA"}]
["MATRÍCULA","II-3.2.5","II-3.2.6",{"$f":"IF('II-3.2.7'!D9='II-3.2.8 '!C10, \"OK\", \"INCONSISTENCIA\")","v":"INCONSISTENCIA"}]
["MATRÍCULA","II-3.2.5","II-3.2.6",{"$f":"IF('II-3.2.7'!E9='II-3.2.8 '!D10, \"OK\", \"INCONSISTENCIA\")","v":"INCONSISTENCIA"}]
["MATRÍCULA","II-3.2.5","II-3.2.6",{"$f":"IF('II-3.2.7'!F9='II-3.2.8 '!F10, \"OK\", \"INCONSISTENCIA\")","v":"OK"}]

{"sheet":"CONTROL Media Superior","index":114,"n_rows":21,"n_cols":4,"rows_kept":21,"cut":false,"hidden":true,"merged":[]}
[null,"PRIMER CUADRO","SEGUNDO CUADRO"]
["MATRÍCULA","II-4.2.1","II-4.2.5",{"$f":"IF(#REF!='II-4.2.5'!B10, \"OK\", \"INCONSISTENCIA\")","v":{"$error":"#REF!"}}]
["MATRÍCULA","II-4.2.1","II-4.2.5",{"$f":"IF(#REF!='II-4.2.5'!D10,\"OK\",\"INCONSISTENCIA\")","v":{"$error":"#REF!"}}]
["MATRÍCULA","II-4.2.1","II-4.2.5",{"$f":"IF(#REF!='II-4.2.5'!F10, \"OK\", \"INCONSISTENCIA\")","v":{"$error":"#REF!"}}]
["MATRÍCULA","II-4.2.1","II-4.2.5",{"$f":"IF(#REF!='II-4.2.5'!C10, \"OK\", \"INCONSISTENCIA\")","v":{"$error":"#REF!"}}]
["MATRÍCULA","II-4.2.1","II-4.2.5",{"$f":"IF(#REF!='II-4.2.5'!E10, \"OK\", \"INCONSISTENCIA\")","v":{"$error":"#REF!"}}]
["MATRÍCULA","II-4.2.1","II-4.2.5",{"$f":"IF(#REF!='II-4.2.5'!G10, \"OK\", \"INCONSISTENCIA\")","v":{"$error":"#REF!"}}]
["MATRÍCULA","II-4.2.3","II-4.2.4",{"$f":"IF('II-4.2.3 '!C10='II-4.2.4 '!C8, \"OK\", \"INCONSISTENCIA\")","v":"OK"}]
["MATRÍCULA","II-4.2.3","II-4.2.4",{"$f":"IF('II-4.2.3 '!E10='II-4.2.4 '!D8, \"OK\", \"INCONSISTENCIA\")","v":"INCONSISTENCIA"}]
["MATRÍCULA","II-4.2.3","II-4.2.4",{"$f":"IF('II-4.2.3 '!F10='II-4.2.4 '!E8, \"OK\", \"INCONSISTENCIA\")","v":"INCONSISTENCIA"}]
["MATRÍCULA","II-4.2.3","II-4.2.4",{"$f":"IF('II-4.2.3 '!I10='II-4.2.4 '!H8, \"OK\", \"INCONSISTENCIA\")","v":"INCONSISTENCIA"}]
["MATRÍCULA","II-4.2.3","II-4.2.4",{"$f":"IF('II-4.2.3 '!#REF!='II-4.2.4 '!I8, \"OK\", \"INCONSISTENCIA\")","v":{"$error":"#REF!"}}]
["MATRÍCULA","II-4.2.1","II-4.2.6",{"$f":"IF(#REF!=#REF!, \"OK\", \"INCONSISTENCIA\")","v":{"$error":"#REF!"}}]
["MATRÍCULA","II-4.2.5","II-4.2.9",{"$f":"IF('II-4.2.5'!F10=#REF!, \"OK\", \"INCONSISTENCIA\")","v":{"$error":"#REF!"}}]
["MATRÍCULA","II-4.2.5","II-4.2.9",{"$f":"IF('II-4.2.5'!G10=#REF!, \"OK\", \"INCONSISTENCIA\")","v":{"$error":"#REF!"}}]
["MATRÍCULA","II-4.2.6","II-4.2.7",{"$f":"IF(#REF!='II-4.2.6'!B11, \"OK\", \"INCONSISTENCIA\")","v":{"$error":"#REF!"}}]
["MATRÍCULA","II-4.2.6","II-4.2.8",{"$f":"IF(#REF!=#REF!, \"OK\", \"INCONSISTENCIA\")","v":{"$error":"#REF!"}}]
["MATRÍCULA","II-4.2.9","II-4.2.10",{"$f":"IF(#REF!='II-4.2.8'!B12, \"OK\", \"INCONSISTENCIA\")","v":{"$error":"#REF!"}}]
["MATRÍCULA","II-4.2.9","II-4.2.10",{"$f":"IF(#REF!='II-4.2.8'!B13,\"OK\",\"INCONSISTENCIA\")","v":{"$error":"#REF!"}}]
["MATRÍCULA","II-4.2.9","II-4.2.10",{"$f":"IF(#REF!='II-4.2.8'!B14,\"OK\",\"INCONSISTENCIA\")","v":{"$error":"#REF!"}}]
["MATRÍCULA","II-4.2.9","II-4.2.11",{"$f":"IF(#REF!=#REF!, \"OK\", \"INCONSISTENCIA\")","v":{"$error":"#REF!"}}]